{"text_format":"1","workbook":"xlsx","n_sheets":21,"sheets":["Développement","Simu","Domination","Stratégie","Mines","Bâtiments","Quêtes","Créatures","Villes","récompenses","Carte","Honneur-début","Conditions de victoire","Combats","HD2.1","TR2","HD2.2","HD2.3","HD2.2a","Feuil1","Feuil2"],"not_rendered":{"charts":8,"images":13,"macros":0,"external_links":0,"defined_names":41,"comments":1,"pivot_tables":0},"unopened":[],"bounds":{"document_bytes":16777216,"sheet_cells":100000,"rows_first":2000,"rows_last":500,"rows_between":2000,"halvings":0,"cell_chars":16384,"cell_head_chars":4096},"cells_cut":0,"cells_raw":0,"read":"whole","date_system":"1900"}

{"sheet":"Développement","index":0,"n_rows":105,"n_cols":70,"rows_kept":105,"cut":false,"hidden":false,"merged":[[1,4,2,4],[1,5,2,5]]}
[null,null,"2010-09-13T14:30:00","Protection débutant",null,"en jaune : ajustements",null,null,"EVOLUTION DU STOCK",null,null,null,null,null,"démarrage le lundi 23",null,null,null,null,null,null,"COUT CONSTRUCTION",null,null,null,null,null,null,null,"ACHAT/VENTE MP",null,null,null,null,null,null,null,"GAINS (COMBATS, RANGS, DONS)",null,null,null,null,null,null,null,"PRODUCTION journalière",null,null,null,null,null,null,"COUT ACHAT",null,null,null,null,null,null,"RECETTE VENTE"]
[null,null,null,null,"Heure","Temps\n(h)"]
[null,null,"Action (coût)",null,null,null,null,null,null,null,null,null,null,null,"Dom.","Rich.","Honn.","Dispo or"]
[]
[null,null,"Départ",null,"2010-09-13T14:30:00",null,3800,4,4,0,0,0,0,null,null,null,null,{"$f":"FLOOR(H5,1)*BF5+FLOOR(I5,1)*BG5+FLOOR(J5,1)*BH5+FLOOR(K5,1)*BI5+FLOOR(L5,1)*BJ5+FLOOR(M5,1)*BK5+G5","v":7800},null,null,null,null,null,null,null,null,null,null,null,null,null,null,null,null,null,null,null,null,null,null,null,null,2000,0,0,0,0,0,0,null,2000,2000,4000,4000,4000,4000,null,500,500,1000,1000,1000,1000]
[null,null,null,null,"2010-09-17T12:00:01",null,3075,6.25,6,{"$f":"J5-W6+AD6+AT6*$F6/24+AL6","v":0},0,2.67,0,null,null,null,null,11535,null,null,null,null,null,null,null,null,null,null,null,null,null,null,null,null,null,null,null,null,null,null,null,null,17098,11.13,11.13,0,0,5.25,0,null,1600,2400,3320,4800,4920,4000,null,400,600,830,1200,1230,1000,null,-0.2,0.2,-0.17,0.2,0.23,0]
[null,null,"Scierie 6 (amel.) + achat bois/minerais","Fin","2010-09-17T18:06:08.990",{"$f":"(E7-E6)*24","v":6.1022194444667548},{"$f":"G6-T7-(IF(AB7>0,AB7*AY7,0)+IF(AC7>0,AC7*AZ7,0)+IF(AD7>0,AD7*BA7,0)+IF(AD7>0,AD7*BA7,0)+IF(AE7>0,AE7*BB7,0)+IF(AF7>0,AF7*BC7,0)+IF(AG7>0,AG7*BD7,0))-(IF(AB7<0,AB7*BF7,0)+IF(AC7<0,AC7*BG7,0)+IF(AD7<0,AD7*BH7,0)+IF(AE7<0,AE7*BI7,0)+IF(AF7<0,AF7*BJ7,0)+IF(AG7<0,AG7*BK7,0))+AQ7*$F7/24+AI7","v":2387.3228358955239},{"$f":"H6-U7+AB7+AR7*$F7/24+AJ7","v":12.079904267371457},{"$f":"I6-V7+AC7+AS7*$F7/24+AK7","v":10.829904267371457},0,0,{"$f":"L6-Y7+AF7+AV7*$F7/24+AN7","v":4.0048605034771025},0,null,null,null,null,18107.322835895524,null,null,null,null,null,null,null,null,null,null,null,null,null,null,null,null,-5035,3,2,null,null,null,null,null,{"$f":"AQ6","v":17098},{"$f":"AR6","v":11.13},{"$f":"AS6","v":11.13},{"$f":"AT6","v":0},{"$f":"AU6","v":0},{"$f":"AV6","v":5.25},{"$f":"AW6","v":0},null,{"$f":"AY6","v":1600},{"$f":"AZ6","v":2400},{"$f":"BA6","v":3320},{"$f":"BB6","v":4800},{"$f":"BC6","v":4920},{"$f":"BD6","v":4000},null,{"$f":"BF6","v":400},{"$f":"BG6","v":600},{"$f":"BH6","v":830},{"$f":"BI6","v":1200},{"$f":"BJ6","v":1230},{"$f":"BK6","v":1000}]
[null,null,null,null,"2010-09-17T18:06:08.990",0,{"$f":"G7-T8-(IF(AB8>0,AB8*AY8,0)+IF(AC8>0,AC8*AZ8,0)+IF(AD8>0,AD8*BA8,0)+IF(AD8>0,AD8*BA8,0)+IF(AE8>0,AE8*BB8,0)+IF(AF8>0,AF8*BC8,0)+IF(AG8>0,AG8*BD8,0))-(IF(AB8<0,AB8*BF8,0)+IF(AC8<0,AC8*BG8,0)+IF(AD8<0,AD8*BH8,0)+IF(AE8<0,AE8*BI8,0)+IF(AF8<0,AF8*BJ8,0)+IF(AG8<0,AG8*BK8,0))+AQ8*$F8/24+AI8","v":6077.3228358955239},{"$f":"H7-U8+AB8+AR8*$F8/24+AJ8","v":12.079904267371457},{"$f":"I7-V8+AC8+AS8*$F8/24+AK8","v":10.829904267371457},0,0,{"$f":"L7-Y8+AF8+AV8*$F8/24+AN8","v":1.0048605034771025},0,null,null,null,null,18107.322835895524,null,null,null,null,null,null,null,null,null,null,null,null,null,-3,null,null,null,null,null,null,null,null,null,null,17098,13.356000000000002,11.13,0,0,5.25,0,null,1600,2400,3320,4800,4920,4000,null,400,600,830,1200,1230,1000]
[null,null,"Chenils","Fin","2010-09-17T20:04:00",{"$f":"(E9-E8)*24","v":1.9641694442834705},{"$f":"G8-T9-(IF(AB9>0,AB9*AY9,0)+IF(AC9>0,AC9*AZ9,0)+IF(AD9>0,AD9*BA9,0)+IF(AD9>0,AD9*BA9,0)+IF(AE9>0,AE9*BB9,0)+IF(AF9>0,AF9*BC9,0)+IF(AG9>0,AG9*BD9,0))-(IF(AB9<0,AB9*BF9,0)+IF(AC9<0,AC9*BG9,0)+IF(AD9<0,AD9*BH9,0)+IF(AE9<0,AE9*BI9,0)+IF(AF9<0,AF9*BJ9,0)+IF(AG9<0,AG9*BK9,0))+AQ9*$F9/24+AI9","v":7476.629884160473},{"$f":"H8-U9+AB9+AR9*$F9/24+AJ9","v":13.172964563115208},{"$f":"I8-V9+AC9+AS9*$F9/24+AK9","v":11.740787847157916},{"$f":"J8-W9+AD9+AT9*$F9/24+AL9","v":0},{"$f":"K8-X9+AE9+AU9*$F9/24+AM9","v":0},{"$f":"L8-Y9+AF9+AV9*$F9/24+AN9","v":1.4345225694141117},{"$f":"M8-Z9+AG9+AW9*$F9/24+AO9","v":0},null,null,null,null,21676.629884160473,null,null,null,null,null,null,null,null,null,null,null,null,null,null,null,null,null,null,null,null,null,null,null,null,17098,13.356000000000002,11.13,0,0,5.25,0,null,1600,2400,3320,4800,4920,4000,null,445,645,920,1290,1320,1090]
[null,null,"Guilde des Mages niv 1","Début","2010-09-17T21:04:00",1.0000000001164153,{"$f":"G9-T10-(IF(AB10>0,AB10*AY10,0)+IF(AC10>0,AC10*AZ10,0)+IF(AD10>0,AD10*BA10,0)+IF(AD10>0,AD10*BA10,0)+IF(AE10>0,AE10*BB10,0)+IF(AF10>0,AF10*BC10,0)+IF(AG10>0,AG10*BD10,0))-(IF(AB10<0,AB10*BF10,0)+IF(AC10<0,AC10*BG10,0)+IF(AD10<0,AD10*BH10,0)+IF(AE10<0,AE10*BI10,0)+IF(AF10<0,AF10*BJ10,0)+IF(AG10<0,AG10*BK10,0))+AQ10*$F10/24+AI10","v":2789.0465509100759},{"$f":"H9-U10+AB10+AR10*$F10/24+AJ10","v":1.7294645631799934},{"$f":"I9-V10+AC10+AS10*$F10/24+AK10","v":1.2045378472119039},{"$f":"J9-W10+AD10+AT10*$F10/24+AL10","v":0},{"$f":"K9-X10+AE10+AU10*$F10/24+AM10","v":0},{"$f":"L9-Y10+AF10+AV10*$F10/24+AN10","v":1.6532725694395776},{"$f":"M9-Z10+AG10+AW10*$F10/24+AO10","v":0},null,null,null,null,5199.0465509100759,null,5400,12,11,null,null,null,null,null,null,null,null,null,null,null,null,null,null,null,null,null,null,null,null,17098,13.356000000000002,11.13,0,0,5.25,0,null,1600,2400,3320,4800,4920,4000,null,445,645,920,1290,1320,1090]
[null,null,"Minerais 6 (amel.)","Début","2010-09-17T23:30:00",2.4333333332324401,692.59377306042006,3.0836145631238461,2.3329961804984478,0,0,0.18556423608417383,0,null,null,null,null,{"$f":"FLOOR(H11,1)*BF11+FLOOR(I11,1)*BG11+FLOOR(J11,1)*BH11+FLOOR(K11,1)*BI11+FLOOR(L11,1)*BJ11+FLOOR(M11,1)*BK11+G11","v":3317.5937730604201},null,6470,null,null,null,null,null,null,null,null,null,null,null,-2,null,null,null,null,null,null,null,null,null,null,17098,13.356000000000002,11.13,0,0,5.25,0,null,1600,2400,3320,4800,4920,4000,null,445,645,920,1290,1320,1090]
[null,null,null,null,{"$f":"NOW()","v":"2010-09-29T23:41:22.700"},288.18963888898725,{"$f":"G11-T12-(IF(AB12>0,AB12*AY12,0)+IF(AC12>0,AC12*AZ12,0)+IF(AD12>0,AD12*BA12,0)+IF(AD12>0,AD12*BA12,0)+IF(AE12>0,AE12*BB12,0)+IF(AF12>0,AF12*BC12,0)+IF(AG12>0,AG12*BD12,0))-(IF(AB12<0,AB12*BF12,0)+IF(AC12<0,AC12*BG12,0)+IF(AD12<0,AD12*BH12,0)+IF(AE12<0,AE12*BI12,0)+IF(AF12<0,AF12*BJ12,0)+IF(AG12<0,AG12*BK12,0))+AQ12*$F12/24+AI12","v":204193.6956782231},163.46114860484528,135.98094121526628,0,0,63.227047743050136,0,null,null,null,null,{"$f":"FLOOR(H12,1)*BF12+FLOOR(I12,1)*BG12+FLOOR(J12,1)*BH12+FLOOR(K12,1)*BI12+FLOOR(L12,1)*BJ12+FLOOR(M12,1)*BK12+G12","v":446963.6956782231},null,1810,null,null,null,null,null,null,null,null,null,null,null,null,null,null,null,null,null,null,null,null,null,null,17098,13.356000000000002,11.13,0,0,5.25,0,null,1600,2400,3320,4800,4920,4000,null,445,645,920,1290,1320,1090]
[null,null,null,null,"2010-09-18T04:47:30.470",-282.8978416667087,2652.5583108320425,6.0284997173218642,4.7870671423301303,0,0,1.3431448784576077,0,null,null,null,null,9222.5583108320425,null,null,null,null,null,null,null,null,null,null,null,null,null,null,null,null,null,null,null,null,null,null,null,null,17098,13.356000000000002,11.13,0,0,5.25,0,null,1600,2400,3320,4800,4920,4000,null,445,645,920,1290,1320,1090]
[null,null,null,null,{"$f":"E13+2/24","v":"2010-09-18T06:47:30.470"},2.0000000000582077,4077.3916442068439,7.1414997173542574,5.714567142357124,0,0,1.7806448784703406,0,null,null,null,null,11737.391644206844,null,null,null,null,null,null,null,null,null,null,null,null,null,null,null,null,null,null,null,null,null,null,null,null,17098,13.356000000000002,11.13,0,0,5.25,0,null,1600,2400,3320,4800,4920,4000,null,445,645,920,1290,1320,1090]
[null,null,null,null,"2010-09-18T08:47:30.470",2.0000000000582077,5502.2249775816454,8.2544997173866506,6.6420671423841178,0,0,2.2181448784830735,0,null,null,null,null,15572.224977581645,null,null,null,null,null,null,null,null,null,null,null,null,null,null,null,null,null,null,null,null,null,null,null,null,17098,13.356000000000002,11.13,0,0,5.25,0,null,1600,2400,3320,4800,4920,4000,null,445,645,920,1290,1320,1090]
[null,null,null,null,"2010-09-18T10:47:30.470",2.0000000000582077,6927.0583109564468,9.3674997174190437,7.5695671424111115,0,0,2.6556448784958064,0,null,null,null,null,18087.058310956447,null,null,null,null,null,null,null,null,null,null,null,null,null,null,null,null,null,null,null,null,null,null,null,null,17098,13.356000000000002,11.13,0,0,5.25,0,null,1600,2400,3320,4800,4920,4000,null,445,645,920,1290,1320,1090]
[null,null,null,null,"2010-09-18T12:47:30.470",{"$f":"(E17-E16)*24","v":2.0000000000582077},8351.8916443312482,10.480499717451437,8.4970671424381052,0,0,3.0931448785085394,0,null,null,null,null,21921.891644331248,null,null,null,null,null,null,null,null,null,null,null,null,null,null,null,null,null,null,null,null,null,null,null,null,17098,13.356000000000002,11.13,0,0,5.25,0,null,1600,2400,3320,4800,4920,4000,null,445,645,920,1290,1320,1090]
[null,null,null,null,"2010-09-29T21:40:18.050",{"$f":"(E18-E17)*24","v":272.87988333305111},{"$f":"12960+6706+32988","v":52654},{"$f":"22+5+5","v":32},{"$f":"28+5+5","v":38},4,6,2,0,null,null,null,null,105464,null,null,null,null,null,null,null,null,null,null,null,null,null,null,null,null,null,null,null,null,null,null,null,null,97246.8,51.949000000000005,51.186000000000007,7.9310000000000009,0,7.3500000000000005,0,null,1600,2400,3320,4800,4920,4000,null,445,645,920,1290,1320,1090]
[null,null,null,null,{"$f":"E18+5/24","v":"2010-09-30T02:40:18.050"},{"$f":"(E19-E18)*24","v":5.0000000000582077},{"$f":"G18-T19-(IF(AB19>0,AB19*AY19,0)+IF(AC19>0,AC19*AZ19,0)+IF(AD19>0,AD19*BA19,0)+IF(AD19>0,AD19*BA19,0)+IF(AE19>0,AE19*BB19,0)+IF(AF19>0,AF19*BC19,0)+IF(AG19>0,AG19*BD19,0))-(IF(AB19<0,AB19*BF19,0)+IF(AC19<0,AC19*BG19,0)+IF(AD19<0,AD19*BH19,0)+IF(AE19<0,AE19*BI19,0)+IF(AF19<0,AF19*BJ19,0)+IF(AG19<0,AG19*BK19,0))+AQ19*$F19/24+AI19","v":72913.750000235857},{"$f":"H18-U19+AB19+AR19*$F19/24+AJ19","v":42.822708333459325},{"$f":"I18-V19+AC19+AS19*$F19/24+AK19","v":48.663750000124146},{"$f":"J18-W19+AD19+AT19*$F19/24+AL19","v":5.652291666685902},{"$f":"K18-X19+AE19+AU19*$F19/24+AM19","v":6},{"$f":"L18-Y19+AF19+AV19*$F19/24+AN19","v":3.5312500000178266},{"$f":"M18-Z19+AG19+AW19*$F19/24+AO19","v":0},null,null,null,null,138863.75000023586,null,null,null,null,null,null,null,null,null,null,null,null,null,null,null,null,null,null,null,null,null,null,null,null,97246.8,51.949000000000005,51.186000000000007,7.9310000000000009,0,7.3500000000000005,0,null,1600,2400,3320,4800,4920,4000,null,445,645,920,1290,1320,1090]
[null,"u","2mines 8>","(perdu 1)",{"$f":"E19+5/24","v":"2010-09-30T07:40:18.050"},{"$f":"(E20-E19)*24","v":5.0000000000582077},60978.500000471715,36.645416666918649,35.327500000248293,-3.695416666628196,6,3.0625000000356533,0,null,null,null,null,107593.50000047171,null,{"$f":"34000*2","v":68000},null,null,null,null,null,null,null,-17,-24,-11,null,-2,null,null,null,null,null,null,null,null,null,null,97246.8,51.949000000000005,51.186000000000007,7.9310000000000009,0,7.3500000000000005,0,null,1600,2400,3320,4800,4920,4000,null,445,645,920,1290,1320,1090]
[null,null,"8 ateliers niv 1",null,"2010-09-30T12:40:18.050",5.0000000000582077,57238.250000707572,41.468125000377974,39.991250000372439,-3.043124999942294,6,10.593750000053479,0,null,null,null,null,117898.25000070757,null,24000,6,6,1,null,1,null,null,null,null,null,null,null,null,null,null,null,null,null,null,7,null,null,97246.8,51.949000000000005,51.186000000000007,7.9310000000000009,0,7.3500000000000005,0,null,1600,2400,3320,4800,4920,4000,null,445,645,920,1290,1320,1090]
[null,null,null,null,"2010-09-30T17:40:18.050",5.0000000000582077,77498.00000094343,52.290833333837298,50.655000000496585,-1.390833333256392,6,12.125000000071305,0,null,null,null,null,154628.00000094343,null,null,null,null,null,null,null,null,null,null,null,null,null,null,null,null,null,null,null,null,null,null,null,null,97246.8,51.949000000000005,51.186000000000007,7.9310000000000009,0,7.3500000000000005,0,null,1600,2400,3320,4800,4920,4000,null,445,645,920,1290,1320,1090]
[null,null,null,null,"2010-09-30T22:40:18.050",5.0000000000582077,97757.750001179287,63.113541667296623,61.318750000620732,0.26145833342950997,6,13.65625000008913,0,null,null,null,null,190037.75000117929,null,null,null,null,null,null,null,null,null,null,null,null,null,null,null,null,null,null,null,null,null,null,null,null,97246.8,51.949000000000005,51.186000000000007,7.9310000000000009,0,7.3500000000000005,0,null,1600,2400,3320,4800,4920,4000,null,445,645,920,1290,1320,1090]
[null,null,"Achat de troupes",null,"2010-10-01T03:40:18.050",5.0000000000582077,58017.500001415145,73.936250000755948,71.982500000744878,1.913750000115412,6,15.187500000106956,0,null,null,null,null,164757.50000141514,null,60000,null,null,null,null,null,null,null,null,null,null,null,null,null,null,null,null,null,null,null,null,null,null,97246.8,51.949000000000005,51.186000000000007,7.9310000000000009,0,7.3500000000000005,0,null,1600,2400,3320,4800,4920,4000,null,445,645,920,1290,1320,1090]
[null,null,"Pallier richesse 4","Attente",{"$f":"MIN(Stratégie!D44:E44)","v":"2010-10-01T17:57:11.342"},14.281469916575588,-16314.697970116395,34.849086696430334,25.441304965321468,6.6331807462971204,6,19.561200162058231,0,null,null,null,null,53280.302029883605,null,90000,90,90,null,null,null,null,null,20,13,null,null,null,null,null,21000,null,null,null,null,null,null,null,97246.8,51.949000000000005,51.186000000000007,7.9310000000000009,0,7.3500000000000005,0,null,1600,2400,3320,4800,4920,4000,null,445,645,920,1290,1320,1090]
[null,null,null,null,"2010-10-01T19:57:11.342",2.0000000000582077,-8210.7979698805393,39.178170029889657,29.70680496544561,7.2940974129830227,6,20.173700162076056,0,null,null,null,null,68429.202030119457,null,null,null,null,null,null,null,null,null,null,null,null,null,null,null,null,null,null,null,null,null,null,null,null,97246.8,51.949000000000005,51.186000000000007,7.9310000000000009,0,7.3500000000000005,0,null,1600,2400,3320,4800,4920,4000,null,445,645,920,1290,1320,1090]
[null,null,null,null,"2010-10-01T21:57:11.342",2.0000000000582077,-106.89796964468405,43.50725336334898,33.972304965569755,7.955014079668925,6,20.786200162093881,0,null,null,null,null,80893.102030355309,null,null,null,null,null,null,null,null,null,null,null,null,null,null,null,null,null,null,null,null,null,null,null,null,97246.8,51.949000000000005,51.186000000000007,7.9310000000000009,0,7.3500000000000005,0,null,1600,2400,3320,4800,4920,4000,null,445,645,920,1290,1320,1090]
[null,null,null,null,"2010-10-01T23:57:11.342",2.0000000000582077,7997.0020305911712,47.836336696808303,38.237804965693897,8.6159307463548274,6,21.398700162111705,0,null,null,null,null,96242.002030591175,null,null,null,null,null,null,null,null,null,null,null,null,null,null,null,null,null,null,null,null,null,null,null,null,97246.8,51.949000000000005,51.186000000000007,7.9310000000000009,0,7.3500000000000005,0,null,1600,2400,3320,4800,4920,4000,null,445,645,920,1290,1320,1090]
[null,null,null,null,"2010-10-02T01:57:11.342",2.0000000000582077,16100.902030827026,52.165420030267626,42.503304965818039,9.2768474130407288,6,22.01120016212953,0,null,null,null,null,111390.90203082703,null,null,null,null,null,null,null,null,null,null,null,null,null,null,null,null,null,null,null,null,null,null,null,null,97246.8,51.949000000000005,51.186000000000007,7.9310000000000009,0,7.3500000000000005,0,null,1600,2400,3320,4800,4920,4000,null,445,645,920,1290,1320,1090]
[null,null,null,null,"2010-10-02T03:57:11.342",2.0000000000582077,24204.802031062882,56.494503363726949,46.768804965942181,9.9377640797266302,6,22.623700162147355,0,null,null,null,null,123854.80203106288,null,null,null,null,null,null,null,null,null,null,null,null,null,null,null,null,null,null,null,null,null,null,null,null,97246.8,51.949000000000005,51.186000000000007,7.9310000000000009,0,7.3500000000000005,0,null,1600,2400,3320,4800,4920,4000,null,445,645,920,1290,1320,1090]
[null,null,null,null,"2010-10-02T05:57:11.342",2.0000000000582077,32308.702031298737,60.823586697186272,51.034304966066323,10.598680746412532,6,23.236200162165179,0,null,null,null,null,139203.70203129874,null,null,null,null,null,null,null,null,null,null,null,null,null,null,null,null,null,null,null,null,null,null,null,null,97246.8,51.949000000000005,51.186000000000007,7.9310000000000009,0,7.3500000000000005,0,null,1600,2400,3320,4800,4920,4000,null,445,645,920,1290,1320,1090]
[null,null,null,null,"2010-10-02T07:57:11.342",2.0000000000582077,40412.602031534596,65.152670030645595,55.299804966190464,11.259597413098433,6,23.848700162183004,0,null,null,null,null,153032.6020315346,null,null,null,null,null,null,null,null,null,null,null,null,null,null,null,null,null,null,null,null,null,null,null,null,97246.8,51.949000000000005,51.186000000000007,7.9310000000000009,0,7.3500000000000005,0,null,1600,2400,3320,4800,4920,4000,null,445,645,920,1290,1320,1090]
[null,null,null,null,"2010-10-02T09:57:11.342",2.0000000000582077,48516.502031770448,69.481753364104918,59.565304966314606,11.920514079784335,6,24.461200162200829,0,null,null,null,null,166816.50203177045,null,null,null,null,null,null,null,null,null,null,null,null,null,null,null,null,null,null,null,null,null,null,null,null,97246.8,51.949000000000005,51.186000000000007,7.9310000000000009,0,7.3500000000000005,0,null,1600,2400,3320,4800,4920,4000,null,445,645,920,1290,1320,1090]
[null,null,null,null,"2010-10-02T11:57:11.342",2.0000000000582077,56620.402032006299,73.810836697564241,63.830804966438748,12.581430746470236,6,25.073700162218653,0,null,null,null,null,181520.4020320063,null,null,null,null,null,null,null,null,null,null,null,null,null,null,null,null,null,null,null,null,null,null,null,null,97246.8,51.949000000000005,51.186000000000007,7.9310000000000009,0,7.3500000000000005,0,null,1600,2400,3320,4800,4920,4000,null,445,645,920,1290,1320,1090]
[null,null,null,null,null,null,null,null,null,null,null,null,null,null,null,null,null,null,null,"OU 90K ?"]
[null,null,"Ecuries infernales",null,{"$f":"NOW()+2+6/24","v":"2010-10-02T05:41:22.700"},null,null,null,"Pente actu",null,null,null,null,null,null,null,null,null,null,"NE PAS VENDRE BOIS ET MINERAIS"]
[null,null,null,null,null,null,"or et bois !",null,null,null,null,null,null,null,null,null,null,"Ecuries infernales",null,27600,33,35,6,null,5,null,null,null,null,null,null,null,null,null,null,null,null,null,null,null,null,null,"Produciton des villes:"]
[null,null,null,"Scierie 9",27200,37.36666666666666,"Plus tard",null,null,null,null,null,"(passer niv 3. dom)"]
[null,null,null,"Minerai 8",16800,27.766666666666669,null,null,null,null,null,null,null,null,null,null,null,null,null,null,null,null,null,null,null,null,null,null,null,null,null,null,null,null,null,null,null,null,null,null,null,null,{"$f":"Villes!E9","v":100044.00000000001},{"$f":"Villes!F9","v":53.461000000000006},{"$f":"Villes!G9","v":53.314000000000007},{"$f":"Villes!H9","v":9.3280000000000012},{"$f":"Villes!I9","v":0},{"$f":"Villes!J9","v":7.3500000000000005},{"$f":"Villes!K9","v":0}]
[null,null,2600,"Or 8",16800,27.766666666666669,"10 heures",null,null,null,null,null,4,3,null,null,null,null,null,null,null,null,null,{"$f":"6*4800","v":28800}]
[null,null,null,null,44800,null,null,null,null,null,null,null,null,null,null,null,null,null,null,{"$f":"75/5","v":15}]
[null,null,null,null,null,null,"bâtisseur tenancier meneur"]
[null,null,"Hôtel de ville","Nécropole","administration",null,"architecte marchand et espion",null,null,null,null,null,null,null,null,null,null,null,null,{"$f":"1000000/3365","v":297.1768202080238}]
[null,null,"Mercure 7 (amel.)","Debut",null,null,"barbare pilleur chevalier et combattant",null,null,null,null,null,null,null,null,null,null,null,null,{"$f":"T43/4","v":74.29420505200595}]
[null,null,"Or 8 (perf.)","Debut"]
[null,null,null,null,null,null,null,null,null,null,null,null,null,null,null,null,null,null,null,{"$f":"15*4*5","v":300}]
[null,null,{"$f":"NOW()","v":"2010-09-29T23:41:22.700"},13,{"$f":"D47*500","v":6500}]
[null,null,"2010-09-26T09:00:00",21,{"$f":"D48*500","v":10500},{"$f":"10355+E47+E48","v":27355},null,null,null,null,null,null,null,null,{"$f":"P48*(4*2000+2500)","v":829500},{"$f":"13+35+31","v":79},3365,{"$f":"Q48*P48","v":265835}]
[null,null,{"$f":"C47+1+9/24+0.5/24","v":"2010-10-01T09:11:22.700"},29000]
[]
[null,null,"Combat (azkran) "," ",null,null,null,null,null,null,171,172,62,135,null,81,{"$f":"SUM(K51:P51)","v":621},{"$f":"Q51*70","v":43470}]
[null,null,"Hôtel de ville","Fin",null,null,null,null,null,null,100,103,17,85,null,13,{"$f":"SUM(K52:P52)","v":318},{"$f":"Q52*134","v":42612}]
[null,null,null,"Attente",null,null,null,null,null,null,57,77,13,46,null,null,193,{"$f":"Q53*303","v":58479}]
[null,null,"Silo à ressources niv 3","Debut"]
[null,null,"Recrutement (tout)","Attente"]
[null,null,"Minerais 8 (amel.)","Fin",null,null,null,null,null,null,null,null,null,null,null,null,null,{"$f":"SUM(R47:R53)","v":410396}]
[null,null,"Pallier richesse 2","Attente",null,null,null,null,null,null,null,null,null,null,null,null,null,594615]
[null,null,"Mercure 8 (amel.)","Fin",null,null,null,null,null,null,null,null,null,null,null,null,null,{"$f":"R56+R57","v":1005011}]
[]
[null,null,null,"Attente"]
[]
[]
[null,null,"Achat de troupes"]
[]
[]
[null,null,"Pallier richesse 3","Attente"]
[]
[]
[]
[null,null,"Pallier richesse 4","Attente"]
[]
[null,null,"Manoir de vampires","Debut"]
[]
[]
[]
[]
[]
[]
[null,null,null,null,null,null,"Le gain net par jour est de 3502"]
[null,null,"Paliers",null,null,null,"Le cout est 44800+21600*1,04 = 67264",null,null,null,null,null,"(perte d'or)"]
[null,"http://wiki.of-might-and-magic.com/index.php/Rang"]
[null,null,null,null,null,null,"Deuxième ville: il faudra des troupes pour déblayer rapidement les mines"]
[]
[null,"Niveaux","Domination","Richesse","Honneur",null,"Jours d'attente à partir de Fantomes"]
[null,1,34000,320000,15000,null,{"$f":"(68000-#REF!-Villes!#REF!)/I85","v":{"$error":"#REF!"}},null,5027,null,{"$f":"L85+G85","v":{"$error":"#REF!"}},"2010-08-31T16:10:00"]
[null,2,68000,640000,30000,null,"Jour d'attente à partir de Manoir:"]
[null,3,136000,1280000,80000,null,{"$f":"(68000-#REF!-Villes!#REF!)/I87","v":{"$error":"#REF!"}},null,8782]
[null,4,272000,2560000,160000]
[null,5,544000,5120000,320000,null,"Booster la richesse"]
[null,6,1088000,10240000,640000,null,"Jour d'attente à partir de Manoir:"]
[null,7,2176000,20480000," ??",null,{"$f":"(68000-#REF!-Villes!#REF!)/I91","v":{"$error":"#REF!"}},null,8782]
[null,8,4352000,40960000," ??"]
[null,9,8704000,81920000,7680000,null,"Booster la richesse"]
[null,10," ??",163840000," ??",null,null,">> Trouver une victoire écrasante",null,null,null,"11 fantomes dans 33 heures"]
[null,null,null,null,null,null,null,">> Hôtel de ville",null,null,null,null,null,27,null,"avec kaz"]
[null,null,null,null,null,null,null,">> libérer la région"]
[null,null,"2010-08-31T09:27:00",null,null,null,null,">> augmenter les mines"]
[]
[null,null,null,null,null,null,null,"un combat augmente t-il la dom ?"]
[null,null,null,null,null,null,null,"non"]
[]
[]
[null,null,null,null,null,null,null,"En faisant que des perfectionnements"]
[null,null,null,null,null,null,null,"En faisant que des améliorations"]
[null,null,null,null,null,null,null,"combien de temps pour arriver au niveau suivant ?"]

{"sheet":"Simu","index":1,"n_rows":413,"n_cols":121,"rows_kept":413,"cut":false,"hidden":false,"merged":[]}
[null,null,null,null,null,null,null,null,null,null,null,null,null,null,null,null,null,null,null,null,null,"Crédit supplémentaires par mine",null,null,null,null,null,null,null,null,null,null,null,null,null,null,"Crédit supplémentaires par mine",null,null,null,null,null,null,null,null,null,null,null,null,null,null,"Crédit supplémentaires par mine",null,null,null,null,null,null,null,null,null,null,null,null,null,null,"Crédit supplémentaires par mine",null,null,null,null,null,null,null,null,null,null,null,null,null,null,"Crédit supplémentaires par mine",null,null,null,null,null,null,null,null,null,null,null,null,null,null,"Crédit supplémentaires par mine"]
[null,null,null,null,null,null,null,null,null,null,null,null,null,null,null,null,null,null,null,null,null,"Capital T0","Jours","Perf.","N.","Revenus",null,null,null,null,null,null,null,null,null,null,"Capital T0","Jours","Perf.","N.","Revenus",null,null,null,null,null,null,null,null,null,null,null,"Jours","Perf.","N.","Revenus",null,null,null,null,null,null,null,null,null,null,null,"Jours","Perf.","N.","Revenus",null,null,null,null,null,null,null,null,null,null,null,"Jours","Perf.","N.","Revenus",null,null,null,null,null,null,null,null,null,null,null,"Jours","Perf.","N.","Revenus"]
[null,null,null,null,null,null,null,null,null,null,null,null,null,null,null,null,null,null,null,null,null,0,{"$f":"MIN(W21:AF30)","v":7.0572070335150965},0.05,8,{"$f":"Y3*2000*(1+X3)","v":16800},null,null,null,null,null,null,null,null,null,null,0,{"$f":"MIN(AL21:AU30)","v":6.9188766763722391},0.05,8,{"$f":"AN3*2000*(1+AM3)","v":16800},null,null,null,null,null,null,null,null,null,null,0,{"$f":"MIN(BA21:BJ30)","v":6.5298151593342304},0.05,8,{"$f":"BC3*2000*(1+BB3)","v":16800},null,null,null,null,null,null,null,null,null,null,0,{"$f":"MIN(BP21:BY30)","v":6.3827710789067842},0.05,8,{"$f":"BR3*2000*(1+BQ3)","v":16800},null,null,null,null,null,null,null,null,null,null,0,{"$f":"MIN(CE21:CN30)","v":3.6658020243497758},0.05,7,{"$f":"CG3*2000*(1+CF3)","v":14700},null,null,null,null,null,null,null,null,null,null,0,{"$f":"MIN(CT21:DC30)","v":6.0260237957972942},0.05,8,{"$f":"CV3*2000*(1+CU3)","v":16800}]
[null,"Calculs réalisés pour 1 mine d'or pour laquelle un héros serait en permanence disponible",null,null,null,null,null,null,null,null,null,null,null,null,null,null,null,null,null,null,null,10000,{"$f":"MIN(W36:AF45)","v":6.02388365189654},0.1,8,17600,null,null,null,null,null,null,null,null,null,null,10000,{"$f":"MIN(AL36:AU45)","v":5.8646273688277581},0.1,8,{"$f":"AN4*2000*(1+AM4)","v":17600},null,null,null,null,null,null,null,null,null,null,10000,{"$f":"MIN(BA36:BJ45)","v":5.5898969963502507},0.1,8,{"$f":"BC4*2000*(1+BB4)","v":17600},null,null,null,null,null,null,null,null,null,null,10000,{"$f":"MIN(BP36:BY45)","v":5.420608821434616},0.1,8,{"$f":"BR4*2000*(1+BQ4)","v":17600},null,null,null,null,null,null,null,null,null,null,10000,{"$f":"MIN(CE36:CN45)","v":3.471160343698414},0.05,7,{"$f":"CG4*2000*(1+CF4)","v":14700},null,null,null,null,null,null,null,null,null,null,10000,{"$f":"MIN(CT36:DC45)","v":5.7649243955487171},0.1,9,{"$f":"CV4*2000*(1+CU4)","v":19800}]
[null,null,null,null,null,null,null,null,null,null,null,null,null,null,null,null,null,null,null,null,null,20000,{"$f":"MIN(W51:AF60)","v":5.7595249612912545},0.1,8,17600,null,null,null,null,null,null,null,null,null,null,20000,{"$f":"MIN(AL51:AU60)","v":5.5644855458691378},0.1,8,17600,null,null,null,null,null,null,null,null,null,null,20000,{"$f":"MIN(BA51:BJ60)","v":5.36651888479894},0.1,8,17600,null,null,null,null,null,null,null,null,null,null,20000,{"$f":"MIN(BP51:BY60)","v":5.1515651214622222},0.1,8,17600,null,null,null,null,null,null,null,null,null,null,20000,{"$f":"MIN(CE51:CN60)","v":3.4108358866013586},0.1,8,17600,null,null,null,null,null,null,null,null,null,null,20000,{"$f":"MIN(CT51:DC60)","v":5.6876485552688258},0.15,9,20700]
[null,null,null,null,null,null,null,null,null,null,null,null,"Temps dep du héros pour atteindre la mine (15 minutes / case)",{"$f":"(15*SQRT(2)*2)/60","v":0.70710678118654757},"(heure)",null,null,null,null,null,null,30000,{"$f":"MIN(W65:AF74)","v":5.6129240824410136},0.15,8,18400,null,null,null,null,null,null,null,null,null,null,30000,{"$f":"MIN(AL65:AU74)","v":5.3905480903775214},0.15,8,18400,null,null,null,null,null,null,null,null,null,null,30000,{"$f":"MIN(BA65:BJ74)","v":5.238951300540589},0.15,8,18400,null,null,null,null,null,null,null,null,null,null,30000,{"$f":"MIN(BP65:BY74)","v":5.0025673719691586},0.15,8,18400,null,null,null,null,null,null,null,null,null,null,30000,{"$f":"MIN(CE65:CN74)","v":3.3854119978244643},0.15,8,18400,null,null,null,null,null,null,null,null,null,null,30000,{"$f":"MIN(CT65:DC74)","v":5.6336747608492477},0.15,9,20700]
[null,null,null,null,null,null,null,null,null,null,null,null,"Richesse à produire par mine pour atteindre le palier ",{"$f":"(N50-N47)/4","v":160000},null,null,null,null,"Palier (1 mine)",80000,null,40000,{"$f":"MIN(W79:AF88)","v":5.5969130029933751},0.15,8,18400,null,null,null,null,null,null,null,"Palier (1 mine)",80000,null,40000,{"$f":"MIN(AL79:AU88)","v":5.329885573944102},0.1,9,19800,null,null,null,null,null,null,null,"Palier (1 mine)",80000,null,40000,{"$f":"MIN(BA79:BJ88)","v":5.2380504008009856},0.1,9,19800,null,null,null,null,null,null,null,"Palier (1 mine)",80000,null,40000,{"$f":"MIN(BP79:BY88)","v":4.9645586482949202},0.1,9,19800,null,null,null,null,null,null,null,"Palier (1 mine)",160000,null,40000,{"$f":"MIN(CE79:CN88)","v":3.3854119978244643},0.15,8,18400,null,null,null,null,null,null,null,"Palier (1 mine)",{"$f":"(N52-N51)/4","v":320000},null,40000,{"$f":"MIN(CT79:DC88)","v":5.6190788951790136},0.2,9,21600]
[null,null,null,null,null,null,null,null,null,null,null,null,null,null,"*",null,null,null,null,null,null,50000,{"$f":"MIN(W93:AF102)","v":5.5293547680928761},0.15,9,20700,null,null,null,null,null,null,null,null,null,null,50000,{"$f":"MIN(AL93:AU102)","v":5.1917621755002834},0.15,9,20700,null,null,null,null,null,null,null,null,null,null,50000,{"$f":"MIN(BA93:BJ102)","v":5.2103657883663086},0.15,9,20700,null,null,null,null,null,null,null,null,null,null,50000,{"$f":"MIN(BP93:BY102)","v":4.851507520649772},0.15,9,20700,null,null,null,null,null,null,null,null,null,null,50000,{"$f":"MIN(CE93:CN102)","v":3.3854119978244643},0.15,8,18400,null,null,null,null,null,null,null,null,null,null,50000,{"$f":"MIN(CT93:DC102)","v":5.5943826592920161},0.2,9,21600]
[null,null,null,null,null,null,null,null,null,null,null,null,"Richesse initiale",0,null,null,null,null,"Richesse initiale",0,null,60000,{"$f":"MIN(W107:AF116)","v":5.5134801637885094},0.2,9,21600,null,null,null,null,null,null,null,"Richesse initiale",0,null,60000,{"$f":"MIN(AL107:AU116)","v":5.1535370978423201},0.2,9,21600,null,null,null,null,null,null,null,"Richesse initiale",0,null,60000,{"$f":"MIN(BA107:BJ116)","v":5.2077823915505483},0.2,9,21600,null,null,null,null,null,null,null,"Richesse initiale",0,null,60000,{"$f":"MIN(BP107:BY116)","v":4.8151970897132781},0.2,9,21600,null,null,null,null,null,null,null,"Richesse initiale",0,null,60000,{"$f":"MIN(CE107:CN116)","v":3.3854119978244643},0.15,8,18400,null,null,null,null,null,null,null,"Richesse initiale",0,null,60000,{"$f":"MIN(CT107:DC116)","v":5.5936270790791927},0.2,9,21600]
[null,null,null,null,null,null,null,null,null,null,null,null,null,null,null,null,null,null,null,null,null,70000,{"$f":"MIN(W121:AF130)","v":0},null,null,0,null,null,null,null,null,null,null,null,null,null,70000,{"$f":"MIN(AL121:AU130)","v":5.1441591761341892},0.2,9,21600,null,null,null,null,null,null,null,null,null,null,70000,{"$f":"MIN(BA121:BJ130)","v":5.2077823915505483},0.2,9,21600,null,null,null,null,null,null,null,null,null,null,70000,{"$f":"MIN(BP121:BY130)","v":4.8151970897132781},0.2,9,21600,null,null,null,null,null,null,null,null,null,null,70000,{"$f":"MIN(CE121:CN130)","v":3.3854119978244643},0.15,8,18400,null,null,null,null,null,null,null,null,null,null,70000,{"$f":"MIN(CT121:DC130)","v":5.5907651821263373},0.2,10,24000]
[null,null,null,null,null,null,null,null,null,null,null,null,"Contremaitre",0.09,"(0, 9, 18, 27)",null,null,null,"Contremaitre",0,null,null,null,null,null,null,null,null,null,null,null,null,null,"Contremaitre",0.27,null,null,null,null,null,null,null,null,null,null,null,null,null,"Contremaitre",0,null,null,null,null,null,null,null,null,null,null,null,null,null,"Contremaitre",0.27,null,null,null,null,null,null,null,null,null,null,null,null,null,"Contremaitre",0.27,null,null,null,null,null,null,null,null,null,null,null,null,null,"Contremaitre",0.27]
[null,null,null,null,null,null,null,null,null,null,null,null,"Chercheur d'or",0.03,"(0, 3,6,9)",null,null,null,"Chercheur d'or",0,null,{"$f":"1600*4","v":6400},null,null,null,null,null,null,null,null,null,null,null,"Chercheur d'or",0,null,null,null,null,null,null,null,null,null,null,null,null,null,"Chercheur d'or",0.09,null,null,null,null,null,null,null,null,null,null,null,null,null,"Chercheur d'or",0.09,null,null,null,null,null,null,null,null,null,null,null,null,null,"Chercheur d'or",0.09,null,null,null,null,null,null,null,null,null,null,null,null,null,"Chercheur d'or",0.09,null,"VILLE 3"]
[null,null,null,null,null,null,null,null,null,null,null,null,"Revenus externes quotidiens mobilisés pour la mine",0,0.6,null,null,null,"Revenus externes quotidiens mobilisable par mine",0,null,null,null,null,null,null,null,null,null,null,null,null,null,"Revenus quotidiens",0,null,null,null,null,null,null,null,null,null,null,null,null,null,"Revenus quotidiens",0,null,null,null,null,null,null,null,null,null,null,null,null,null,"Revenus quotidiens",null,null,null,null,null,null,null,null,null,null,null,null,null,null,"Revenus externes quotidiens mobilisable par mine",5000,null,null,null,null,null,null,null,null,null,null,null,null,null,"Revenus externes quotidiens mobilisable par mine",5000]
[null,null,null,null,null,null,null,null,null,null,null,null,null,null,null,null,null,null,null,null,null,null,null,null,null,null,null,null,null,null,null,null,null,null,null,null,null,null,null,null,null,null,null,null,null,null,null,null,null,null,null,null,null,null,null,null,null,null,null,null,null,null,null,null,null,null,null,null,null,null,null,null,null,null,null,null,null,null,null,7697.732]
[null,null,null,null,null,null,null,null,null,null,null,null,"Richesse quotidienne produite par l'ensemble des autres villes",0,null,null,null,null,null,null,null,null,"EXEMPLE : PREMIERE VILLE, PASSAGE AU RANG 2",null,null,null,null,null,null,null,null,null,null,null,null,null,null,null,null,null,null,null,null,null,null,null,null,null,null,null,null,null,null,null,null,null,null,null,null,null,null,null,null,null,null,null,null,null,null,null,null,null,null,null,null,null,null,null,"Richesse quotidienne produite par la ville 1",84918,null,null,null,null,null,null,null,null,null,null,null,null,null,"Richesse quotidienne produite par les villes 1 et 2",{"$f":"84918+18400*4","v":158518}]
[null,null,null,null,null,null,null,null,null,null,null,null,"Exemple de valeur calculée (1 ville externe produit)",{"$f":"(Villes!E17+Villes!F17*1000+Villes!G17*1000+Villes!H17*2000)","v":16008},"(0, 9, 18, 27)",null,null,null,null,null,null,null,null,null,null,null,null,null,null,null,null,null,null,null,null,null,null,null,null,null,null,null,null,null,null,null,null,null,null,null,null,null,null,null,null,null,null,null,null,null,null,null,null,null,null,null,null,null,null,null,null,null,null,null,null,null,null,null,null,8002.5,null,"EXEMPLE : DEUXIEME VILLE, PASSAGE AU RANG 3",null,null,null,null,null,null,null,null,null,null,null,null,null,null,"EXEMPLE : TROISIEME VILLE, PASSAGE AU RANG 4"]
[null,null,null,null,null,null,null,null,null,null,null,null,"Marchand",0,null,null,null,null,null,null,null,null,null,null,null,null,null,null,null,null,null,null,null,null,null,null,null,null,null,null,null,null,null,null,null,null,null,null,null,null,null,null,null,null,null,null,null,null,null,null,null,null,null,null,null,null,null,null,null,null,null,null,null,null,null,null,null,null,null,0.18]
[null,null,null,null,null,null,null,null,null,null,null,null,null,null,null,null,null,null,null,null,null,null,null,null,null,null,null,null,null,null,null,null,null,null,null,null,null,null,null,null,null,null,null,null,null,null,null,null,null,null,null,null,null,null,null,null,null,null,null,null,null,null,null,null,null,null,null,null,null,null,null,null,null,null,null,null,null,null,null,"Capital initial",null,null,null,null,null,null,null,null,null,null,null,null,null,null,"Capital initial"]
[null,null,null,null,null,null,null,null,null,null,null,null,"Capital immobilisé pour la mine (initial)",2000,null,null,null,null,null,0,null,null,"niv.",null,null,null,null,null,null,null,null,null,null,null,0,null,null,"niv.",null,null,null,null,null,null,null,null,null,null,null,0,null,null,"niv.",null,null,null,null,null,null,null,null,null,null,null,0,null,null,"niv.",null,null,null,null,null,null,null,null,null,null,null,0,null,null,"niv.",null,null,null,null,null,null,null,null,null,null,null,0,null,null,"niv."]
[null,"Résultats en jours pour atteindre le palier",null,null,null,null,null,null,null,null,null,null,null,null,null,null,null,null,null,"revenus /J",null,"Perf.",1,2,3,4,5,6,7,8,9,10,null,null,"revenus /J",null,"Perf.",1,2,3,4,5,6,7,8,9,10,null,null,"revenus /J",null,"Perf.",1,2,3,4,5,6,7,8,9,10,null,null,"revenus /J",null,"Perf.",1,2,3,4,5,6,7,8,9,10,null,null,"revenus /J",null,"Perf.",1,2,3,4,5,6,7,8,9,10,null,null,"revenus /J",null,"Perf.",1,2,3,4,5,6,7,8,9,10]
[null,null,null,"niv.",null,null,null,null,null,null,null,null,null,null,null,null,null,null,null,16800,1,0,40,20.078472222222221,13.66412037037037,10.586689814814815,8.8780787037037037,7.8909027777777778,7.3609424603174602,7.16984623015873,"N/A","N/A",null,null,16800,1,0,40,20.062777777777775,13.637962962962964,10.549351851851851,8.8264629629629638,7.820722222222221,7.2672301587301575,7.0472103174603165,"N/A","N/A",null,null,16800,1,0,36.697247706422019,18.42709607543323,12.546689177709817,9.7279742184845386,8.1663355844376486,7.2683339704383272,6.7918467853502236,6.6284700833697379,"N/A","N/A",null,null,16800,1,0,36.697247706422019,18.41041300456709,12.518884059599582,9.6882842578546189,8.1114684584533965,7.1937325924855706,6.6922313466550616,6.4981090738084344,"N/A","N/A",null,null,16800,1,0,4.5480386583285961,4.2898661857578295,4.0939175960996783,3.9276471523274359,3.7977158102123401,3.7115799158571678,3.6731503520073976,"N/A","N/A","N/A",null,null,16800,1,0,7.6537629007761394,7.2805874288162515,6.9715613500207123,6.6983410210054002,6.4659203844946367,6.2802645163148636,6.1444581566215213,6.0662119973218278,"N/A","N/A",null,null,null,null,null,null,"Voir l''évolution en cumul avec plusieurs villes (voir quel niveau de production en sortie)"]
[null,null,"Perf.",1,2,3,4,5,6,7,8,9,10,null,"15% et niv. 9",null,null,null,null,null,2,0.05,null,19.182817152562713,13.139893872139435,10.24341569753626,8.6386141102346734,7.7155651684357309,7.2255141480275675,7.0572070335150965,"N/A","N/A",null,null,null,2,0.05,null,19.151428263673822,13.098042020287584,10.190383290128853,8.5713039250494862,7.6296901684357312,7.1161074019958219,6.9188766763722391,"N/A","N/A",null,null,null,2,0.05,null,17.61007796514463,12.070431224695135,9.4177276241417651,7.9513270853329692,7.1121575668629919,6.6722844157676908,6.5298151593342304,"N/A","N/A",null,null,null,2,0.05,null,17.576711823412346,12.025943035718758,9.3613545926457018,7.8797768884825761,7.0208731180440935,6.5559859062063861,6.3827710789067842,"N/A","N/A",null,null,null,2,0.05,null,4.2702162629086624,4.0781134980379941,3.9164328479979793,3.7858986449700094,3.7022320598018732,3.6658020243497758,"N/A","N/A","N/A",null,null,null,2,0.05,null,7.2491361585156762,6.9377727533530642,6.6638887198081971,6.4271655185208285,6.2405972824642451,6.1041033671389258,6.0260237957972942,"N/A","N/A",null,null,null,null,null,null,"Voir l'influence d'un héros qui augmente la tune"]
[null,1,0,{"$f":"AK178","v":77.669902912621353},{"$f":"AK180","v":38.906944320734738},{"$f":"AK182","v":26.042318204460805},{"$f":"AK184","v":19.734381855579638},{"$f":"AK186","v":16.081429647113936},{"$f":"AK188","v":13.791184817354988},{"$f":"AK190","v":12.322614505705491},{"$f":"AK192","v":11.418537113265781},{"$f":"AK194","v":10.954269700162229},{"$f":"AK196","v":10.878864921998478},null,"5% et niv. 8",null,null,null,null,null,3,0.1,null,null,12.943361311717791,10.302294392525873,8.8464105541420341,8.0180225070039857,7.5902266917081711,7.4621174745364556,"N/A","N/A",null,null,null,3,0.1,null,null,12.880583533940014,10.228336059192539,8.7581744430309243,7.9112215810780606,7.4598940197504984,7.302861191467672,"N/A","N/A",null,null,null,3,0.1,null,null,11.896774870635936,9.4783935227534446,8.148614771942583,7.3962901109596642,7.0135318269399125,6.9079413754062262,"N/A","N/A",null,null,null,3,0.1,null,null,11.83004258717137,9.399776396769191,8.0548204806039987,7.2827615676525763,6.8749892228904184,6.7386532004905906,"N/A","N/A",null,null,null,3,0.1,null,null,4.1077107621065547,3.9777531268118915,3.8766297965639627,3.8079324782246182,3.7884822888779568,"N/A","N/A","N/A",null,null,null,3,0.1,null,null,6.9432085677514674,6.6926132112424872,6.4783574917892022,6.3025927574972593,6.1793900476655885,6.1133212018691303,"N/A","N/A",null,null,null,null,null,null,"Voir l'influence d'un héros qui augmente la vitesse de minage"]
[null,2,0.05,null,{"$f":"AK207","v":37.107907442976554},{"$f":"AK209","v":24.91981083818359},{"$f":"AK211","v":18.945516036536208},{"$f":"AK213","v":15.488125547904069},{"$f":"AK215","v":13.323323775627012},{"$f":"AK217","v":11.938631675456282},{"$f":"AK219","v":11.090528128865593},{"$f":"AK221","v":10.661063202020836},{"$f":"AK223","v":10.602199236514402},null,null,null,null,null,null,null,4,0.15,null,null,null,10.401224901713491,9.1682659645154239,8.4842784443866002,8.1547322056012295,"N/A","N/A","N/A",null,null,null,4,0.15,null,null,null,10.293724901713492,9.0464881867376477,8.3439358517940079,7.9908578669768922,"N/A","N/A","N/A",null,null,null,4,0.15,null,null,null,9.5814931959948293,8.4562327031525637,7.8363855898845296,7.5437645320211519,"N/A","N/A","N/A",null,null,null,4,0.15,null,null,null,9.4672215424515223,8.326783884254926,7.6872025190183875,7.3695674004126008,"N/A","N/A","N/A",null,null,null,4,0.15,null,null,null,3.9969778099379858,3.9160576366045481,3.8739953371453946,"N/A","N/A","N/A","N/A",null,null,null,4,0.15,null,null,null,6.6854344501034415,6.4855923948813476,6.3308027763485377,6.2261134037873322,6.1778883173751264,"N/A","N/A",null,null,"Crédit initial par mine",null,null,null,"Et avec 1,2 ou 3 héros seulement ?"]
[null,3,0.1,null,null,{"$f":"AK236","v":24.148310101682611},{"$f":"AK238","v":18.565587050830274},{"$f":"AK240","v":15.338936695850894},{"$f":"AK242","v":13.323478568063114},{"$f":"AK244","v":12.040256888364192},{"$f":"AK246","v":11.261951781890941},{"$f":"AK248","v":10.878835687802786},{"$f":"AK250","v":10.846776991820068},null,null,null,null,null,null,null,5,0.2,null,null,null,null,9.514752583891438,9.0297988801877338,8.837933800822654,"N/A","N/A","N/A",null,null,null,5,0.2,null,null,null,null,9.3358636950025495,8.8323451764840311,8.6169483510872062,"N/A","N/A","N/A",null,null,null,5,0.2,null,null,null,null,8.795539426238193,8.3582921445528378,8.191984076983303,"N/A","N/A","N/A",null,null,null,5,0.2,null,null,null,null,8.6053819459232308,8.1484004122693712,7.957078283957431,"N/A","N/A","N/A",null,null,null,5,0.2,null,null,null,null,4.0326656330599695,"N/A","N/A","N/A","N/A","N/A",null,null,null,5,0.2,null,null,null,null,6.5609659050342612,6.4475526566950618,6.3781522863444913,6.3633737843018388,"N/A","N/A"]
[null,4,0.15,null,null,null,{"$f":"AK265","v":18.258802564848743},{"$f":"AK267","v":15.327251791587768},{"$f":"AK269","v":13.504433442763112},{"$f":"AK271","v":12.354060481814132},{"$f":"AK273","v":11.669635745709222},{"$f":"AK275","v":11.352289208737185},{"$f":"AK277","v":"N/A"},null,null,null,null,null,null,null,6,0.25,null,null,null,null,null,9.6451805240413861,"N/A","N/A","N/A","N/A",null,null,null,6,0.25,null,null,null,null,null,9.3549027462636083,"N/A","N/A","N/A","N/A",null,null,null,6,0.25,null,null,null,null,null,8.9589948893239217,"N/A","N/A","N/A","N/A",null,null,null,6,0.25,null,null,null,null,null,8.6504318971979366,"N/A","N/A","N/A","N/A",null,null,null,6,0.25,null,null,null,null,null,"N/A","N/A","N/A","N/A","N/A",null,null,null,6,0.25,null,null,null,null,null,6.5866004933955011,6.567659272982211,"N/A","N/A","N/A"]
[null,5,0.2,null,null,null,null,{"$f":"AK294","v":15.35917970608179},{"$f":"AK296","v":13.777672740400511},{"$f":"AK298","v":12.795309856706016},{"$f":"AK300","v":12.231616190572362},{"$f":"AK302","v":12.001527130579202},{"$f":"AK304","v":"N/A"},null,null,null,null,null,null,null,7,0.3,null,null,null,null,null,null,"N/A","N/A","N/A","N/A",null,null,null,7,0.3,null,null,null,null,null,null,"N/A","N/A","N/A","N/A",null,null,null,7,0.3,null,null,null,null,null,null,"N/A","N/A","N/A","N/A",null,null,null,7,0.3,null,null,null,null,null,null,"N/A","N/A","N/A","N/A",null,null,null,7,0.3,null,null,null,null,null,null,"N/A","N/A","N/A","N/A",null,null,null,7,0.3,null,null,null,null,null,null,"N/A","N/A","N/A","N/A"]
[null,6,0.25,null,null,null,null,null,{"$f":"AK322","v":14.128411051712575},{"$f":"AK324","v":13.352397374367285},{"$f":"AK326","v":12.938611244063498},{"$f":"AK328","v":12.819004025134701},{"$f":"AK330","v":"N/A"},null,null,null,null,null,null,null,8,0.35,null,null,null,null,null,null,null,"N/A","N/A","N/A",null,null,null,8,0.35,null,null,null,null,null,null,null,"N/A","N/A","N/A",null,null,null,8,0.35,null,null,null,null,null,null,null,"N/A","N/A","N/A",null,null,null,8,0.35,null,null,null,null,null,null,null,"N/A","N/A","N/A",null,null,null,8,0.35,null,null,null,null,null,null,null,"N/A","N/A","N/A",null,null,null,8,0.35,null,null,null,null,null,null,null,"N/A","N/A","N/A",null,null,null,"AMELIORATION"]
[null,7,0.3,null,null,null,null,null,null,{"$f":"AK350","v":12.883502636582778},{"$f":"AK350","v":12.883502636582778},{"$f":"AK354","v":"N/A"},{"$f":"AK356","v":"N/A"},null,null,null,null,null,null,null,9,0.4,null,null,null,null,null,null,null,null,"N/A","N/A",null,null,null,9,0.4,null,null,null,null,null,null,null,null,"N/A","N/A",null,null,null,9,0.4,null,null,null,null,null,null,null,null,"N/A","N/A",null,null,null,9,0.4,null,null,null,null,null,null,null,null,"N/A","N/A",null,null,null,9,0.4,null,null,null,null,null,null,null,null,"N/A","N/A",null,null,null,9,0.4,null,null,null,null,null,null,null,null,"N/A","N/A"]
[null,8,0.35,null,null,null,null,null,null,null,{"$f":"AK380","v":14.836520568841562},{"$f":"AK382","v":"N/A"},{"$f":"AK384","v":"N/A"},null,null,null,null,null,null,null,10,0.45,null,null,null,null,null,null,null,null,null,"N/A",null,null,null,10,0.45,null,null,null,null,null,null,null,null,null,"N/A",null,null,null,10,0.45,null,null,null,null,null,null,null,null,null,"N/A",null,null,null,10,0.45,null,null,null,null,null,null,null,null,null,"N/A",null,null,null,10,0.45,null,null,null,null,null,null,null,null,null,"N/A",null,null,null,10,0.45,null,null,null,null,null,null,null,null,null,"N/A",null,null,null,null,null,"Cout passer au niv.",null,null,null,null,"Cout1","Revenus1",null,"Revenus1"]
[null,9,0.4,null,null,null,null,null,null,null,null,{"$f":"AK409","v":"N/A"},{"$f":"AK411","v":"N/A"},null,null,null,null,null,null,null,null,null,null,null,null,null,null,null,null,null,null,null,null,null,null,null,null,null,null,null,null,null,null,null,null,null,null,null,null,null,null,null,null,null,null,null,null,null,null,null,null,null,null,null,null,null,null,null,null,null,null,null,null,null,null,null,null,null,null,null,null,null,null,null,null,null,null,null,null,null,null,null,null,null,null,null,null,null,null,null,null,null,null,null,null,null,null,null,null,"niv","Heures","T max","T med","T min","Heures",null,null,"Cumul","(ressource)",null,"(or)"]
[null,10,0.45,null,null,null,null,null,null,null,null,null,{"$f":"AK170","v":"N/A"},null,null,null,null,null,null,null,null,null,null,null,null,null,null,null,null,null,null,null,null,null,null,null,null,null,null,null,null,null,null,null,null,null,null,null,null,null,null,null,null,null,null,null,null,null,null,null,null,null,null,null,null,null,null,null,null,null,null,null,null,null,null,null,null,null,null,null,null,null,null,null,null,null,null,null,null,null,null,null,null,null,null,null,null,null,null,null,null,null,null,null,null,null,null,null,null,1,null,null,0,null,null,null,null,0,2,null,2000]
[null,null,null,null,null,null,null,null,null,null,null,null,null,null,null,null,null,null,null,null,null,null,null,null,null,null,null,null,null,null,null,null,null,null,null,null,null,null,null,null,null,null,null,null,null,null,null,null,null,null,null,null,null,null,null,null,null,null,null,null,null,null,null,null,null,null,null,null,null,null,null,null,null,null,null,null,null,null,null,null,null,null,null,null,null,"plus de capital initial  = plus long ???",null,null,null,null,null,null,null,null,null,null,null,null,null,null,null,null,null,null,null,null,null,null,null,2,{"$f":"0.4*DF33^2-2*DF33+137/30","v":2.1666666666666665},{"$f":"7/5*DI33","v":1400},1000,{"$f":"0.8*DI33","v":800},{"$f":"0.8*DF33^2-4*DF33+257/30","v":3.7666666666666666},null,null,{"$f":"DN32+DI33","v":1000},4,null,4000]
[null,null,null,null,null,null,null,null,null,null,null,null,null,null,null,null,null,null,null,10000,null,null,"niv.",null,null,null,null,null,null,null,null,null,null,null,10000,null,null,"niv.",null,null,null,null,null,null,null,null,null,null,null,10000,null,null,"niv.",null,null,null,null,null,null,null,null,null,null,null,10000,null,null,"niv.",null,null,null,null,null,null,null,null,null,null,null,10000,null,null,"niv.",null,null,null,null,null,null,null,null,null,null,null,10000,null,null,"niv.",null,null,null,null,null,null,null,null,null,null,null,3,2.1666666666666665,2800,2000,{"$f":"0.8*DI34","v":1600},{"$f":"0.8*DF34^2-4*DF34+257/30","v":3.7666666666666666},null,null,3000,6,null,6000]
[null,null,"Perf. \\ niv.",1,2,3,4,5,6,7,8,9,10,null,null,null,null,null,null,"revenus /J",null,"Perf.",1,2,3,4,5,6,7,8,9,10,null,null,"revenus /J",null,"Perf.",1,2,3,4,5,6,7,8,9,10,null,null,"revenus /J",null,"Perf.",1,2,3,4,5,6,7,8,9,10,null,null,"revenus /J",null,"Perf.",1,2,3,4,5,6,7,8,9,10,null,null,"revenus /J",null,"Perf.",1,2,3,4,5,6,7,8,9,10,null,null,"revenus /J",null,"Perf.",1,2,3,4,5,6,7,8,9,10,null,null,4,2.9666666666666668,4200,3000,2400,5.3666666666666671,null,null,6000,8,null,8000]
[null,null,0,{"$f":"2000*D$35*(1+$C36)","v":2000},4000,6000,8000,10000,12000,14000,16000,18000,20000,null,null,null,null,null,null,17600,1,0,40,20.078472222222221,13.490277777777777,10.252083333333333,8.3805555555555546,7.2267129629629636,6.5777050264550265,6.2973230820105819,"N/A","N/A",null,null,17600,1,0,40,20.062777777777775,13.45888888888889,10.201666666666666,8.3044444444444458,7.1320370370370361,6.4594973544973548,6.1501917989417993,"N/A","N/A",null,null,17600,1,0,36.697247706422019,18.42709607543323,12.389360346585114,9.4263952599388379,7.7200050968399596,6.6752357288481141,6.0895305446337549,5.8442403433085772,"N/A","N/A",null,null,17600,1,0,36.697247706422019,18.41041300456709,12.355994204852832,9.3728027402537979,7.6390995850289354,6.5684585202843513,5.9577392753275866,5.6817035031362666,"N/A","N/A",null,null,17600,1,0,4.5480386583285961,4.2898661857578295,4.066975268076316,3.8765781374643606,3.7190475051666381,3.5971689655329548,3.5255695974354913,"N/A","N/A","N/A",null,null,17600,1,0,7.6537629007761394,7.2805874288162515,6.9484876834216855,6.6542743957023989,6.3975734071545416,6.1802435221688423,6.014702060908494,5.9091743471222582,5.8742632764636635,"N/A",null,null,5,4.5666666666666664,7000,5000,4000,{"$f":"0.8*DF36^2-4*DF36+257/30","v":8.5666666666666664},null,null,11000,10,null,10000]
[null,null,0.05,null,{"$f":"2000*E$35*(1+$C37)","v":4200},6300,8400,10500,12600,14700,16800,18900,21000,null,null,null,null,null,null,null,2,0.05,null,19.182817152562713,12.893174398004772,9.8042557985035792,8.0222935276917529,6.9405144271626522,6.3370847219472335,6.0837435938293183,"N/A","N/A",null,null,null,2,0.05,null,19.151428263673822,12.851322546152922,9.7459919096146912,7.9399046388028642,6.8395607234589493,6.2125992722117829,5.9303345329827586,"N/A","N/A",null,null,null,2,0.05,null,17.61007796514463,11.844681606392713,9.0178862047945358,7.3931978527245192,6.4084043354195321,5.8645140422992261,5.6440319293470118,"N/A","N/A",null,null,null,2,0.05,null,17.576711823412346,11.800193417416336,8.9559521496764258,7.3056191125670376,6.3010913432935487,5.7321869894308346,5.4809593056124779,"N/A","N/A",null,null,null,2,0.05,null,4.2702162629086624,4.0392286401634934,3.8428858972017594,3.6812422261970918,3.5569122955668258,3.4860725678247606,"N/A","N/A","N/A",null,null,null,2,0.05,null,7.2491361585156762,6.9044321227919943,6.6003361220534247,6.3360935641725273,6.1133310075429845,5.9457838460531551,5.8384560519362836,5.8024162738818283,"N/A",null,null,6,6.9666666666666668,{"$f":"7/5*DI37","v":11200},8000,6400,13.366666666666667,null,null,19000,12,null,12000]
[null,null,0.1,null,null,{"$f":"2000*F$35*(1+$C38)","v":6600.0000000000009},8800,11000,13200.000000000002,15400.000000000002,17600,19800,22000,null,null,null,null,null,null,null,3,0.1,null,null,12.397156517423701,9.4322423880677757,7.7490858224112102,6.7691826237580122,6.2331617002370887,6.02388365189654,"N/A","N/A",null,null,null,3,0.1,null,null,12.334378739645924,9.3582840547344421,7.6608497113000986,6.6623816978320862,6.102829028279416,5.8646273688277581,"N/A","N/A",null,null,null,3,0.1,null,null,11.396322489066735,8.6816168668000522,7.1433310267481591,6.2520016396045497,5.7699542654700204,5.5898969963502507,"N/A","N/A",null,null,null,3,0.1,null,null,11.32959020560217,8.6029997408158003,7.0495367354095748,6.1384730962974636,5.6314116614205272,5.420608821434616,"N/A","N/A",null,null,null,3,0.1,null,null,4.0181388251754493,3.8157394232227926,3.6500333340915851,3.5351528797636291,3.471160343698414,"N/A","N/A","N/A",null,null,null,3,0.1,null,null,6.8663186634724438,6.5524206599535804,6.280862846420062,6.0632910569026484,5.8993572488300057,5.7965868213911955,5.7649243955487171,"N/A",null,null,7,10.166666666666668,18200,13000,10400,19.766666666666669,null,null,32000,14,null,14000]
[null,null,0.15,null,null,null,{"$f":"2000*G$35*(1+$C39)","v":9200},11500,13799.999999999998,16099.999999999998,18400,20700,23000,null,null,null,null,null,null,null,4,0.15,null,null,null,9.4268251140070163,7.9764748724611234,7.1475598161004141,6.7144939085779844,6.5765032684813667,"N/A","N/A",null,null,null,4,0.15,null,null,null,9.3193251140070181,7.8546970946833454,7.0072172235078227,6.5506195699536462,6.3837053187459176,"N/A","N/A",null,null,null,4,0.15,null,null,null,8.687990746961276,7.36328869049715,6.6104805348145437,6.222887303797898,6.1082313266450381,"N/A","N/A",null,null,null,4,0.15,null,null,null,8.5737190934179672,7.2338398715995131,6.4612974639484015,6.0486901721893496,5.9032886241703464,"N/A","N/A",null,null,null,4,0.15,null,null,null,3.8517672971186885,3.7175990151922136,3.6297962518254683,3.591403762548766,"N/A","N/A","N/A",null,null,null,4,0.15,null,null,null,6.559610195044514,6.3123555513189515,6.1162154235789981,5.9732568848969025,5.8901261844665544,"N/A","N/A",null,null,8,14.166666666666668,{"$f":"7/5*DI39","v":29399.999999999996},21000,16800,27.766666666666669,null,null,53000,16,null,16000]
[null,null,0.2,null,null,null,null,{"$f":"2000*H$35*(1+$C40)","v":12000},14400,16800,19200,21600,24000,null,null,null,null,null,null,null,5,0.2,null,null,null,null,8.2867296077791668,7.6628870151865742,7.3718155866151456,"N/A","N/A","N/A",null,null,null,5,0.2,null,null,null,null,8.1078407188902766,7.4654333114828697,7.1508301368796952,"N/A","N/A","N/A",null,null,null,5,0.2,null,null,null,null,7.6693551529791346,7.1046868723131489,6.8473638054717334,"N/A","N/A","N/A",null,null,null,5,0.2,null,null,null,null,7.4791976726641742,6.8947951400296832,6.6124580124458605,"N/A","N/A","N/A",null,null,null,5,0.2,null,null,null,null,3.8205949019263725,3.7769261730243047,"N/A","N/A","N/A","N/A",null,null,null,5,0.2,null,null,null,null,6.375568219785186,6.2163233395376736,6.1084069005088519,6.057610004935956,"N/A","N/A",null,null,9,18.966666666666665,47600,34000,{"$f":"0.8*DI40","v":27200},37.36666666666666,null,null,87000,18,null,18000]
[null,null,0.25,null,null,null,null,null,{"$f":"2000*I$35*(1+$C41)","v":15000},{"$f":"2000*J$35*(1+$C41)","v":17500},{"$f":"2000*K$35*(1+$C41)","v":20000},{"$f":"2000*L$35*(1+$C41)","v":22500},{"$f":"2000*M$35*(1+$C41)","v":25000},null,null,null,null,null,null,null,6,0.25,null,null,null,null,null,8.2504908812624489,8.1433877066592739,"N/A","N/A","N/A",null,null,null,6,0.25,null,null,null,null,null,7.960213103484671,7.829578182849751,"N/A","N/A","N/A",null,null,null,6,0.25,null,null,null,null,null,7.6799054172881061,7.5913605650964655,"N/A","N/A","N/A",null,null,null,6,0.25,null,null,null,null,null,7.3713424251621218,7.2577835122280732,"N/A","N/A","N/A",null,null,null,6,0.25,null,null,null,null,null,"N/A","N/A","N/A","N/A","N/A",null,null,null,6,0.25,null,null,null,null,null,6.3495151898968212,6.290700953836093,"N/A","N/A","N/A",null,null,10,24.566666666666666,77000,55000,44000,48.566666666666663,null,null,142000,20,null,20000]
[null,null,0.3,null,null,null,null,null,null,{"$f":"2000*J$35*(1+$C42)","v":18200},{"$f":"2000*K$35*(1+$C42)","v":20800},{"$f":"2000*L$35*(1+$C42)","v":23400},{"$f":"2000*M$35*(1+$C42)","v":26000},null,null,null,null,null,null,null,7,0.3,null,null,null,null,null,null,"N/A","N/A","N/A","N/A",null,null,null,7,0.3,null,null,null,null,null,null,"N/A","N/A","N/A","N/A",null,null,null,7,0.3,null,null,null,null,null,null,"N/A","N/A","N/A","N/A",null,null,null,7,0.3,null,null,null,null,null,null,"N/A","N/A","N/A","N/A",null,null,null,7,0.3,null,null,null,null,null,null,"N/A","N/A","N/A","N/A",null,null,null,7,0.3,null,null,null,null,null,null,"N/A","N/A","N/A","N/A"]
[null,null,0.35,null,null,null,null,null,null,null,{"$f":"2000*K$35*(1+$C43)","v":21600},{"$f":"2000*L$35*(1+$C43)","v":24300},{"$f":"2000*M$35*(1+$C43)","v":27000},null,null,null,null,null,null,null,8,0.35,null,null,null,null,null,null,null,"N/A","N/A","N/A",null,null,null,8,0.35,null,null,null,null,null,null,null,"N/A","N/A","N/A",null,null,null,8,0.35,null,null,null,null,null,null,null,"N/A","N/A","N/A",null,null,null,8,0.35,null,null,null,null,null,null,null,"N/A","N/A","N/A",null,null,null,8,0.35,null,null,null,null,null,null,null,"N/A","N/A","N/A",null,null,null,8,0.35,null,null,null,null,null,null,null,"N/A","N/A","N/A",null,null,null,"PERFECTIONNEMENT"]
[null,null,0.4,null,null,null,null,null,null,null,null,{"$f":"2000*L$35*(1+$C44)","v":25200},{"$f":"2000*M$35*(1+$C44)","v":28000},null,null,null,null,null,null,null,9,0.4,null,null,null,null,null,null,null,null,"N/A","N/A",null,null,null,9,0.4,null,null,null,null,null,null,null,null,"N/A","N/A",null,null,null,9,0.4,null,null,null,null,null,null,null,null,"N/A","N/A",null,null,null,9,0.4,null,null,null,null,null,null,null,null,"N/A","N/A",null,null,null,9,0.4,null,null,null,null,null,null,null,null,"N/A","N/A",null,null,null,9,0.4,null,null,null,null,null,null,null,null,"N/A","N/A",null,null,null,null,null,"Cout passer au niv.",null,null,null,null,"Cout2","Revenus2",null,"Revenus2"]
[null,null,0.45,null,null,null,null,null,null,null,null,null,{"$f":"2000*M$35*(1+$C45)","v":29000},null,null,null,null,null,null,null,10,0.45,null,null,null,null,null,null,null,null,null,"N/A",null,null,null,10,0.45,null,null,null,null,null,null,null,null,null,"N/A",null,null,null,10,0.45,null,null,null,null,null,null,null,null,null,"N/A",null,null,null,10,0.45,null,null,null,null,null,null,null,null,null,"N/A",null,null,null,10,0.45,null,null,null,null,null,null,null,null,null,"N/A",null,null,null,10,0.45,null,null,null,null,null,null,null,null,null,"N/A",null,null,null,"Heures","T max","T med","T min","Heures",null,"xp","Cumul","(ressource)",null,"(or)"]
[null,null,null,null,null,null,null,null,null,null,null,null,null,null,null,null,null,null,null,null,null,null,null,null,null,null,null,null,null,null,null,null,null,null,null,null,null,null,null,null,null,null,null,null,null,null,null,null,null,null,null,null,null,null,null,null,null,null,null,null,null,null,null,null,null,null,null,null,null,null,null,null,null,null,null,null,null,null,null,null,null,null,null,null,null,null,null,null,null,null,null,null,null,null,null,null,null,null,null,null,null,null,null,null,null,null,null,null,null,1,null,null,{"$f":"1000*DF32^2-1000*DF32","v":0},null,null,null,{"$f":"80*DF46^2-80*DF46","v":0},0,2,null,{"$f":"DL46*DQ32+DQ32","v":2000}]
[null,null,null,null,null,null,null,null,null,null,null,null,null,null,null,null,null,null,null,null,null,null,null,null,null,null,null,null,null,null,null,null,null,null,null,null,null,null,null,null,null,null,null,null,null,null,null,null,null,null,null,null,null,null,null,null,null,null,null,null,null,null,null,null,null,null,null,null,null,null,null,null,null,null,null,null,null,null,null,null,null,null,null,null,null,null,null,null,null,null,null,null,null,null,null,null,null,null,null,null,null,null,null,null,null,null,null,null,null,2,{"$f":"0.4*DF47^2-2*DF47+137/30","v":2.1666666666666665},{"$f":"1400*DF47^2-1400*DF47","v":2800},2000,{"$f":"800*DF47^2-800*DF47","v":1600},{"$f":"0.8*DF47^2-4*DF47+257/30","v":3.7666666666666666},0.05,{"$f":"80*DF47^2-80*DF47","v":160},{"$f":"DN46+DI47","v":2000},{"$f":"DL47*DO33+DO33","v":4.2},null,4200]
[null,null,null,null,null,null,null,null,null,null,null,null,null,"PALIERS",null,null,null,null,null,null,null,null,null,null,null,null,null,null,null,null,null,null,null,null,null,null,null,null,null,null,null,null,null,null,null,null,null,null,null,null,null,null,null,null,null,null,null,null,null,null,null,null,null,null,null,null,null,null,null,null,null,null,null,null,null,null,null,null,null,null,null,null,null,null,null,null,null,null,null,null,null,null,null,null,null,null,null,null,null,null,null,null,null,null,null,null,null,null,null,3,2.1666666666666665,{"$f":"1400*DF48^2-1400*DF48","v":8400},6000,4800,{"$f":"0.8*DF48^2-4*DF48+257/30","v":3.7666666666666666},0.1,480,8000,6.6,null,6600]
[null,null,null,null,null,null,null,null,null,null,null,null,1,320000,null,null,null,null,null,20000,null,null,"niv.",null,null,null,null,null,null,null,null,null,null,null,20000,null,null,"niv.",null,null,null,null,null,null,null,null,null,null,null,20000,null,null,"niv.",null,null,null,null,null,null,null,null,null,null,null,20000,null,null,"niv.",null,null,null,null,null,null,null,null,null,null,null,20000,null,null,"niv.",null,null,null,null,null,null,null,null,null,null,null,20000,null,null,"niv.",null,null,null,null,null,null,null,null,null,null,null,4,2.9666666666666668,16800,12000,9600,5.3666666666666671,0.15,960,20000,9.1999999999999993,null,9200]
[null,null,null,null,null,null,null,null,null,null,null,null,2,640000,null,null,null,null,null,"revenus /J",null,"Perf.",1,2,3,4,5,6,7,8,9,10,null,null,"revenus /J",null,"Perf.",1,2,3,4,5,6,7,8,9,10,null,null,"revenus /J",null,"Perf.",1,2,3,4,5,6,7,8,9,10,null,null,"revenus /J",null,"Perf.",1,2,3,4,5,6,7,8,9,10,null,null,"revenus /J",null,"Perf.",1,2,3,4,5,6,7,8,9,10,null,null,"revenus /J",null,"Perf.",1,2,3,4,5,6,7,8,9,10,null,null,5,4.5666666666666664,28000,20000,16000,8.5666666666666664,0.2,1600,40000,12,null,12000]
[null,null,null,null,null,null,null,null,null,null,null,null,3,1280000,null,null,null,null,null,17600,1,0,40,20.078472222222221,13.490277777777777,10.252083333333333,8.3805555555555546,7.2256944444444455,6.5184523809523816,6.1487847222222225,"N/A","N/A",null,null,17600,1,0,40,20.062777777777775,13.45888888888889,10.201666666666666,8.3044444444444458,7.1138888888888889,6.3576190476190479,5.9590277777777771,"N/A","N/A",null,null,17600,1,0,36.697247706422019,18.42709607543323,12.389360346585114,9.4263952599388379,7.7200050968399596,6.6752357288481141,6.046630624726955,5.719794852191642,"N/A","N/A",null,null,17600,1,0,36.697247706422019,18.41041300456709,12.355994204852832,9.3728027402537979,7.6390995850289354,6.5563873036512632,5.8756660577978206,5.5177167862618095,"N/A","N/A",null,null,17600,1,0,4.5480386583285961,4.2898661857578295,4.066975268076316,3.8765781374643606,3.7190475051666381,3.5971689655329548,3.515596022420115,3.4804464370581751,"N/A","N/A",null,null,17600,1,0,7.6537629007761394,7.2805874288162515,6.9484876834216855,6.6542743957023989,6.3975734071545416,6.1802435221688423,6.005933084506049,5.8797381838848128,5.8270685282222567,"N/A",null,null,6,6.9666666666666668,42000,30000,24000,13.366666666666667,0.25,2400,70000,15,null,15000]
[null,null,null,null,null,null,null,null,null,null,null,null,4,2560000,null,null,null,null,null,null,2,0.05,null,19.182817152562713,12.893174398004772,9.8042557985035792,8.0222935276917529,6.9271427545579431,6.262550932478236,5.9241757907548802,"N/A","N/A",null,null,null,2,0.05,null,19.151428263673822,12.851322546152922,9.7459919096146912,7.9399046388028642,6.810105717520905,6.0972334721607755,5.7299347193263088,"N/A","N/A",null,null,null,2,0.05,null,17.61007796514463,11.844681606392713,9.0178862047945358,7.3931978527245192,6.4028963587519128,5.8131968789302118,5.5155403246194901,"N/A","N/A",null,null,null,2,0.05,null,17.576711823412346,11.800193417416336,8.9559521496764258,7.3056191125670376,6.2784869099330152,5.6374657203250367,5.3082251799879261,"N/A","N/A",null,null,null,2,0.05,null,4.2702162629086624,4.0392286401634934,3.8428858972017594,3.6812422261970918,3.5569122955668258,3.474473476465497,3.4400280673555628,"N/A","N/A",null,null,null,2,0.05,null,7.2491361585156762,6.9044321227919943,6.6003361220534247,6.3360935641725273,6.1133310075429845,5.9355664747633634,5.8078358377354515,5.7539892815685789,"N/A",null,null,7,10.166666666666668,58800,42000,33600,19.766666666666669,0.3,3360,112000,18.2,null,18200]
[null,null,null,null,null,null,null,null,null,null,null,null,5,5120000,null,null,null,null,null,null,3,0.1,null,null,12.397156517423701,9.4322423880677757,7.7246827993431095,6.6791338142674066,6.0499718408006338,5.7595249612912545,"N/A","N/A",null,null,null,3,0.1,null,null,12.334378739645924,9.3582840547344421,7.6297383548986648,6.5516338142674071,5.8838560364896288,5.5644855458691378,"N/A","N/A",null,null,null,3,0.1,null,null,11.396322489066735,8.6816168668000522,7.1241823823289314,6.1787168000889237,5.6210429715047923,5.36651888479894,"N/A","N/A",null,null,null,3,0.1,null,null,11.32959020560217,8.6029997408158003,7.0232571854785375,6.0431853040259318,5.4368347790342169,5.1515651214622222,"N/A","N/A",null,null,null,3,0.1,null,null,4.0181388251754493,3.8157394232227926,3.6498967249141514,3.523030095263044,3.4396211801627961,3.4108358866013586,"N/A","N/A",null,null,null,3,0.1,null,null,6.8663186634724438,6.5524206599535804,6.2807437819794387,6.052656086533533,5.871524316465953,5.7468278525577503,5.6964925433676017,"N/A",null,null,8,14.166666666666668,78400,56000,44800,{"$f":"0.8*DF53^2-4*DF53+257/30","v":27.766666666666669},0.35,4480,168000,21.6,null,21600]
[null,null,null,null,null,null,null,null,null,null,null,null,6,10240000,null,null,null,null,null,null,4,0.15,null,null,null,9.1806315615423042,7.5233941381227325,6.5495515455301394,6.012965969270649,5.7973355776212365,"N/A","N/A",null,null,null,4,0.15,null,null,null,9.0731315615423043,7.4016163603449545,6.4092089529375462,5.8490916306463117,5.6045376278857875,"N/A","N/A",null,null,null,4,0.15,null,null,null,8.4629063571575252,6.9492139746149091,6.0634447765177297,5.5808793723478178,5.3949942653300083,"N/A","N/A",null,null,null,4,0.15,null,null,null,8.3486347036142181,6.8197651557172705,5.9142617056515867,5.4066822407392685,5.1900515628553165,"N/A","N/A",null,null,null,4,0.15,null,null,null,3.8049667381203731,3.6342540073990559,3.5081615301185316,3.4370335946296962,"N/A","N/A","N/A",null,null,null,4,0.15,null,null,null,6.5190577215494816,6.239602722673772,6.0093302036701841,5.8367850009170672,5.7261293297906892,5.6876485552688258,"N/A",null,null,9,18.966666666666665,100800,72000,57600,37.36666666666666,0.4,5760,240000,25.2,null,25200]
[null,null,null,null,null,null,null,null,null,null,null,null,7,20480000,null,null,null,null,null,null,5,0.2,null,null,null,null,7.7869128669086551,7.0241813854271751,6.6339036076493967,6.5225692822525714,"N/A","N/A",null,null,null,5,0.2,null,null,null,null,7.6080239780197667,6.8267276817234706,6.4129181579139463,6.2726602214060101,"N/A","N/A",null,null,null,5,0.2,null,null,null,null,7.211588938949884,6.5194996593032659,6.1711615931899706,6.0809609506240747,"N/A","N/A",null,null,null,5,0.2,null,null,null,null,7.0214314586349236,6.3096079270198011,5.9362558001640995,5.815309586732063,"N/A","N/A",null,null,null,5,0.2,null,null,null,null,3.721011623288307,3.6376681509417916,3.6063785257931578,"N/A","N/A","N/A",null,null,null,5,0.2,null,null,null,null,6.2885099574294046,6.093752216939051,5.9551529545403294,5.8759000601947999,"N/A","N/A",null,null,10,24.566666666666666,126000,90000,72000,48.566666666666663,0.45,7200,330000,29,null,29000]
[null,null,null,null,null,null,null,null,null,null,null,null,8,40960000,null,null,null,null,null,null,6,0.25,null,null,null,null,null,7.5840074737252712,7.3816662038840022,"N/A","N/A","N/A",null,null,null,6,0.25,null,null,null,null,null,7.2937296959474933,7.0678566800744775,"N/A","N/A","N/A",null,null,null,6,0.25,null,null,null,null,null,7.0692340044820963,6.8933147529894514,"N/A","N/A","N/A",null,null,null,6,0.25,null,null,null,null,null,6.7606710123561129,6.5597377001210599,"N/A","N/A","N/A",null,null,null,6,0.25,null,null,null,null,null,3.814819672566883,"N/A","N/A","N/A","N/A",null,null,null,6,0.25,null,null,null,null,null,6.2212301081855976,6.1308460339037065,6.0969195897492554,"N/A","N/A"]
[null,null,null,null,null,null,null,null,null,null,null,null,9,81920000,null,null,null,null,null,null,7,0.3,null,null,null,null,null,null,"N/A","N/A","N/A","N/A",null,null,null,7,0.3,null,null,null,null,null,null,"N/A","N/A","N/A","N/A",null,null,null,7,0.3,null,null,null,null,null,null,"N/A","N/A","N/A","N/A",null,null,null,7,0.3,null,null,null,null,null,null,"N/A","N/A","N/A","N/A",null,null,null,7,0.3,null,null,null,null,null,null,"N/A","N/A","N/A","N/A",null,null,null,7,0.3,null,null,null,null,null,null,"N/A","N/A","N/A","N/A"]
[null,null,null,null,null,null,null,null,null,null,null,null,10,163840000,null,null,null,null,null,null,8,0.35,null,null,null,null,null,null,null,"N/A","N/A","N/A",null,null,null,8,0.35,null,null,null,null,null,null,null,"N/A","N/A","N/A",null,null,null,8,0.35,null,null,null,null,null,null,null,"N/A","N/A","N/A",null,null,null,8,0.35,null,null,null,null,null,null,null,"N/A","N/A","N/A",null,null,null,8,0.35,null,null,null,null,null,null,null,"N/A","N/A","N/A",null,null,null,8,0.35,null,null,null,null,null,null,null,"N/A","N/A","N/A"]
[null,null,null,null,null,null,null,null,null,null,null,null,null,null,null,null,null,null,null,null,9,0.4,null,null,null,null,null,null,null,null,"N/A","N/A",null,null,null,9,0.4,null,null,null,null,null,null,null,null,"N/A","N/A",null,null,null,9,0.4,null,null,null,null,null,null,null,null,"N/A","N/A",null,null,null,9,0.4,null,null,null,null,null,null,null,null,"N/A","N/A",null,null,null,9,0.4,null,null,null,null,null,null,null,null,"N/A","N/A",null,null,null,9,0.4,null,null,null,null,null,null,null,null,"N/A","N/A",null,null,null,null,null,null,null,{"$f":"DK52/125%","v":15.813333333333336}]
[null,null,null,null,null,null,null,null,null,null,null,null,null,null,null,null,null,null,null,null,10,0.45,null,null,null,null,null,null,null,null,null,"N/A",null,null,null,10,0.45,null,null,null,null,null,null,null,null,null,"N/A",null,null,null,10,0.45,null,null,null,null,null,null,null,null,null,"N/A",null,null,null,10,0.45,null,null,null,null,null,null,null,null,null,"N/A",null,null,null,10,0.45,null,null,null,null,null,null,null,null,null,"N/A",null,null,null,10,0.45,null,null,null,null,null,null,null,null,null,"N/A"]
[]
[]
[null,null,null,null,null,null,null,null,null,null,null,null,null,null,null,null,null,null,null,30000,null,null,"niv.",null,null,null,null,null,null,null,null,null,null,null,30000,null,null,"niv.",null,null,null,null,null,null,null,null,null,null,null,30000,null,null,"niv.",null,null,null,null,null,null,null,null,null,null,null,30000,null,null,"niv.",null,null,null,null,null,null,null,null,null,null,null,30000,null,null,"niv.",null,null,null,null,null,null,null,null,null,null,null,30000,null,null,"niv.",null,null,null,null,null,null,null,null,null,null,null,null,21600]
[null,null,null,null,null,null,null,null,null,null,null,null,null,null,null,null,null,null,null,"revenus /J",null,"Perf.",1,2,3,4,5,6,7,8,9,10,null,null,"revenus /J",null,"Perf.",1,2,3,4,5,6,7,8,9,10,null,null,"revenus /J",null,"Perf.",1,2,3,4,5,6,7,8,9,10,null,null,"revenus /J",null,"Perf.",1,2,3,4,5,6,7,8,9,10,null,null,"revenus /J",null,"Perf.",1,2,3,4,5,6,7,8,9,10,null,null,"revenus /J",null,"Perf.",1,2,3,4,5,6,7,8,9,10]
[null,null,null,null,null,null,null,null,null,null,null,null,null,null,null,null,null,null,null,17600,1,0,40,20.078472222222221,13.490277777777777,10.252083333333333,8.3805555555555546,7.2256944444444455,6.5184523809523816,6.1326388888888896,"N/A","N/A",null,null,17600,1,0,40,20.062777777777775,13.45888888888889,10.201666666666666,8.3044444444444458,7.1138888888888889,6.3576190476190479,5.9061111111111124,"N/A","N/A",null,null,17600,1,0,36.697247706422019,18.42709607543323,12.389360346585114,9.4263952599388379,7.7200050968399596,6.6752357288481141,6.046630624726955,5.719794852191642,"N/A","N/A",null,null,17600,1,0,36.697247706422019,18.41041300456709,12.355994204852832,9.3728027402537979,7.6390995850289354,6.5563873036512632,5.8756660577978206,5.4789976080971527,"N/A","N/A",null,null,17600,1,0,4.5480386583285961,4.2898661857578295,4.066975268076316,3.8765781374643606,3.7190475051666381,3.5971689655329548,3.515596022420115,3.4804464370581751,"N/A","N/A",null,null,17600,1,0,7.6537629007761394,7.2805874288162515,6.9484876834216855,6.6542743957023989,6.3975734071545416,6.1802435221688423,6.005933084506049,5.8797381838848128,5.8079363173469085,"N/A"]
[null,null,null,null,null,null,null,null,null,null,null,null,null,null,null,null,null,null,null,null,2,0.05,null,19.182817152562713,12.893174398004772,9.8042557985035792,8.0222935276917529,6.9271427545579431,6.262550932478236,5.9087251214740117,"N/A","N/A",null,null,null,2,0.05,null,19.151428263673822,12.851322546152922,9.7459919096146912,7.9399046388028642,6.810105717520905,6.0972334721607755,5.678273732585124,"N/A","N/A",null,null,null,2,0.05,null,17.61007796514463,11.844681606392713,9.0178862047945358,7.3931978527245192,6.4028963587519128,5.8131968789302118,5.5155403246194901,"N/A","N/A",null,null,null,2,0.05,null,17.576711823412346,11.800193417416336,8.9559521496764258,7.3056191125670376,6.2784869099330152,5.6374657203250367,5.2705723128084667,"N/A","N/A",null,null,null,2,0.05,null,4.2702162629086624,4.0392286401634934,3.8428858972017594,3.6812422261970918,3.5569122955668258,3.474473476465497,3.4400280673555628,"N/A","N/A",null,null,null,2,0.05,null,7.2491361585156762,6.9044321227919943,6.6003361220534247,6.3360935641725273,6.1133310075429845,5.9355664747633634,5.8078358377354515,5.7364043959298288,"N/A"]
[null,null,null,null,null,null,null,null,null,null,null,null,null,null,null,null,null,null,null,null,3,0.1,null,null,12.397156517423701,9.4322423880677757,7.7246827993431095,6.6791338142674066,6.0499718408006338,5.7227184162561109,"N/A","N/A",null,null,null,3,0.1,null,null,12.334378739645924,9.3582840547344421,7.6297383548986648,6.5516338142674071,5.8756861265149203,5.4844198051450004,"N/A","N/A",null,null,null,3,0.1,null,null,11.396322489066735,8.6816168668000522,7.1241823823289314,6.1787168000889237,5.6210429715047923,5.3474056556222491,"N/A","N/A",null,null,null,3,0.1,null,null,11.32959020560217,8.6029997408158003,7.0232571854785375,6.0431853040259318,5.4357786295475368,5.0940961083781549,"N/A","N/A",null,null,null,3,0.1,null,null,4.0181388251754493,3.8157394232227926,3.6498967249141514,3.523030095263044,3.4396211801627961,3.4057400686633166,"N/A","N/A",null,null,null,3,0.1,null,null,6.8663186634724438,6.5524206599535804,6.2807437819794387,6.052656086533533,5.871524316465953,5.7423064388809797,5.6723164917323867,"N/A"]
[null,null,null,null,null,null,null,null,null,null,null,null,null,null,null,null,null,null,null,null,4,0.15,null,null,null,9.1806315615423042,7.5233941381227325,6.511393263250425,5.9061942256432216,5.6129240824410136,"N/A","N/A",null,null,null,4,0.15,null,null,null,9.0731315615423043,7.4016163603449545,6.361532152139314,5.7127418446908402,5.3905480903775214,"N/A","N/A",null,null,null,4,0.15,null,null,null,8.4629063571575252,6.9492139746149091,6.0329097936605729,5.4960655374233482,5.238951300540589,"N/A","N/A",null,null,null,4,0.15,null,null,null,8.3486347036142181,6.8197651557172705,5.8736086125582103,5.2904271797180611,5.0025673719691586,"N/A","N/A",null,null,null,4,0.15,null,null,null,3.8049667381203731,3.6342540073990559,3.5042425533928769,3.4192903237823153,3.3854119978244643,"N/A","N/A",null,null,null,4,0.15,null,null,null,6.5190577215494816,6.239602722673772,6.0058864444930293,5.8210989546223191,5.6900992528599872,5.6336747608492477,"N/A"]
[null,null,null,null,null,null,null,null,null,null,null,null,null,null,null,null,null,null,null,null,5,0.2,null,null,null,null,7.5332896785028591,6.6316693081324889,6.1421851811483617,5.9564460938467745,"N/A","N/A",null,null,null,5,0.2,null,null,null,null,7.3544007896139698,6.4342156044287844,5.9211997314129121,5.7065370330002141,"N/A","N/A",null,null,null,5,0.2,null,null,null,null,6.9789071147243824,6.1593968360971321,5.7200437707119569,5.5615818786921523,"N/A","N/A",null,null,null,5,0.2,null,null,null,null,6.7887496344094211,5.9495051038136673,5.4851379776860858,5.2959305148001388,"N/A","N/A",null,null,null,5,0.2,null,null,null,null,3.6533775054429927,3.5185080498756545,3.4304531051026723,3.4033605968420129,"N/A","N/A",null,null,null,5,0.2,null,null,null,null,6.2307693554341377,6.0096144125823949,5.8415190829640711,5.7367507964269988,5.7036568192351984,"N/A"]
[null,null,null,null,null,null,null,null,null,null,null,null,null,null,null,null,null,null,null,null,6,0.25,null,null,null,null,null,7.1637176186528073,6.8661382535734425,"N/A","N/A","N/A",null,null,null,6,0.25,null,null,null,null,null,6.8734398408750295,6.5523287297639188,"N/A","N/A","N/A",null,null,null,6,0.25,null,null,null,null,null,6.6836469814798374,6.4203533306861864,"N/A","N/A","N/A",null,null,null,6,0.25,null,null,null,null,null,6.3750839893538522,6.0867762778177941,"N/A","N/A","N/A",null,null,null,6,0.25,null,null,null,null,null,3.6604270635012548,3.6261783776151915,"N/A","N/A","N/A",null,null,null,6,0.25,null,null,null,null,null,6.1308784963732323,6.0109685356609468,5.9511853756626927,"N/A","N/A"]
[null,null,null,null,null,null,null,null,null,null,null,null,null,null,null,null,null,null,null,null,7,0.3,null,null,null,null,null,null,"N/A","N/A","N/A","N/A",null,null,null,7,0.3,null,null,null,null,null,null,"N/A","N/A","N/A","N/A",null,null,null,7,0.3,null,null,null,null,null,null,"N/A","N/A","N/A","N/A",null,null,null,7,0.3,null,null,null,null,null,null,"N/A","N/A","N/A","N/A",null,null,null,7,0.3,null,null,null,null,null,null,"N/A","N/A","N/A","N/A",null,null,null,7,0.3,null,null,null,null,null,null,"N/A","N/A","N/A","N/A"]
[null,null,null,null,null,null,null,null,null,null,null,null,null,null,null,null,null,null,null,null,8,0.35,null,null,null,null,null,null,null,"N/A","N/A","N/A",null,null,null,8,0.35,null,null,null,null,null,null,null,"N/A","N/A","N/A",null,null,null,8,0.35,null,null,null,null,null,null,null,"N/A","N/A","N/A",null,null,null,8,0.35,null,null,null,null,null,null,null,"N/A","N/A","N/A",null,null,null,8,0.35,null,null,null,null,null,null,null,"N/A","N/A","N/A",null,null,null,8,0.35,null,null,null,null,null,null,null,"N/A","N/A","N/A"]
[null,null,null,null,null,null,null,null,null,null,null,null,null,null,null,null,null,null,null,null,9,0.4,null,null,null,null,null,null,null,null,"N/A","N/A",null,null,null,9,0.4,null,null,null,null,null,null,null,null,"N/A","N/A",null,null,null,9,0.4,null,null,null,null,null,null,null,null,"N/A","N/A",null,null,null,9,0.4,null,null,null,null,null,null,null,null,"N/A","N/A",null,null,null,9,0.4,null,null,null,null,null,null,null,null,"N/A","N/A",null,null,null,9,0.4,null,null,null,null,null,null,null,null,"N/A","N/A"]
[null,null,null,null,null,null,null,null,null,null,null,null,null,null,null,null,null,null,null,null,10,0.45,null,null,null,null,null,null,null,null,null,"N/A",null,null,null,10,0.45,null,null,null,null,null,null,null,null,null,"N/A",null,null,null,10,0.45,null,null,null,null,null,null,null,null,null,"N/A",null,null,null,10,0.45,null,null,null,null,null,null,null,null,null,"N/A",null,null,null,10,0.45,null,null,null,null,null,null,null,null,null,"N/A",null,null,null,10,0.45,null,null,null,null,null,null,null,null,null,"N/A"]
[]
[]
[null,null,null,null,null,null,null,null,null,null,null,null,null,null,null,null,null,null,null,40000,null,null,"niv.",null,null,null,null,null,null,null,null,null,null,null,40000,null,null,"niv.",null,null,null,null,null,null,null,null,null,null,null,40000,null,null,"niv.",null,null,null,null,null,null,null,null,null,null,null,40000,null,null,"niv.",null,null,null,null,null,null,null,null,null,null,null,40000,null,null,"niv.",null,null,null,null,null,null,null,null,null,null,null,40000,null,null,"niv."]
[null,null,null,null,null,null,null,null,null,null,null,null,null,null,null,null,null,null,null,null,null,"Perf.",1,2,3,4,5,6,7,8,9,10,null,null,null,null,"Perf.",1,2,3,4,5,6,7,8,9,10,null,null,null,null,"Perf.",1,2,3,4,5,6,7,8,9,10,null,null,null,null,"Perf.",1,2,3,4,5,6,7,8,9,10,null,null,null,null,"Perf.",1,2,3,4,5,6,7,8,9,10,null,null,null,null,"Perf.",1,2,3,4,5,6,7,8,9,10]
[null,null,null,null,null,null,null,null,null,null,null,null,null,null,null,null,null,null,null,"revenus /J",1,0,40,20.078472222222221,13.490277777777777,10.252083333333333,8.3805555555555546,7.2256944444444455,6.5184523809523816,6.1326388888888896,6.0055555555555555,"N/A",null,null,"revenus /J",1,0,40,20.062777777777775,13.45888888888889,10.201666666666666,8.3044444444444458,7.1138888888888889,6.3576190476190479,5.9061111111111124,5.6945061728395068,"N/A",null,null,"revenus /J",1,0,36.697247706422019,18.42709607543323,12.389360346585114,9.4263952599388379,7.7200050968399596,6.6752357288481141,6.046630624726955,5.719794852191642,5.6385830784913358,"N/A",null,null,"revenus /J",1,0,36.697247706422019,18.41041300456709,12.355994204852832,9.3728027402537979,7.6390995850289354,6.5563873036512632,5.8756660577978206,5.4789976080971527,5.3066933147118078,"N/A",null,null,"revenus /J",1,0,4.5480386583285961,4.2898661857578295,4.066975268076316,3.8765781374643606,3.7190475051666381,3.5971689655329548,3.515596022420115,3.4804464370581751,"N/A","N/A",null,null,"revenus /J",1,0,7.6537629007761394,7.2805874288162515,6.9484876834216855,6.6542743957023989,6.3975734071545416,6.1802435221688423,6.005933084506049,5.8797381838848128,5.8079363173469085,"N/A"]
[null,null,null,null,null,null,null,null,null,null,null,null,null,null,null,null,null,null,null,20700,2,0.05,null,19.182817152562713,12.893174398004772,9.8042557985035792,8.0222935276917529,6.9271427545579431,6.262550932478236,5.9087251214740117,5.8065210956312203,"N/A",null,null,20700,2,0.05,null,19.151428263673822,12.851322546152922,9.7459919096146912,7.9399046388028642,6.810105717520905,6.0972334721607755,5.678273732585124,5.4908112190880116,"N/A",null,null,20700,2,0.05,null,17.61007796514463,11.844681606392713,9.0178862047945358,7.3931978527245192,6.4028963587519128,5.8131968789302118,5.5155403246194901,5.4570234984272012,"N/A",null,null,20700,2,0.05,null,17.576711823412346,11.800193417416336,8.9559521496764258,7.3056191125670376,6.2784869099330152,5.6374657203250367,5.2705723128084667,5.1214263855663091,"N/A",null,null,20700,2,0.05,null,4.2702162629086624,4.0392286401634934,3.8428858972017594,3.6812422261970918,3.5569122955668258,3.474473476465497,3.4400280673555628,"N/A","N/A",null,null,20700,2,0.05,null,7.2491361585156762,6.9044321227919943,6.6003361220534247,6.3360935641725273,6.1133310075429845,5.9355664747633634,5.8078358377354515,5.7364043959298288,"N/A"]
[null,null,null,null,null,null,null,null,null,null,null,null,null,null,null,null,null,null,null,null,3,0.1,null,null,12.397156517423701,9.4322423880677757,7.7246827993431095,6.6791338142674066,6.0499718408006338,5.7227184162561109,5.6411818021041968,"N/A",null,null,null,3,0.1,null,null,12.334378739645924,9.3582840547344421,7.6297383548986648,6.5516338142674071,5.8756861265149203,5.4844198051450004,5.329885573944102,"N/A",null,null,null,3,0.1,null,null,11.396322489066735,8.6816168668000522,7.1241823823289314,6.1787168000889237,5.6210429715047923,5.3474056556222491,5.3075704593185424,"N/A",null,null,null,3,0.1,null,null,11.32959020560217,8.6029997408158003,7.0232571854785375,6.0431853040259318,5.4357786295475368,5.0940961083781549,4.9645586482949202,"N/A",null,null,null,3,0.1,null,null,4.0181388251754493,3.8157394232227926,3.6498967249141514,3.523030095263044,3.4396211801627961,3.4057400686633166,"N/A","N/A",null,null,null,3,0.1,null,null,6.8663186634724438,6.5524206599535804,6.2807437819794387,6.052656086533533,5.871524316465953,5.7423064388809797,5.6712399589538069,"N/A"]
[null,null,null,null,null,null,null,null,null,null,null,null,null,null,null,null,null,null,null,null,4,0.15,null,null,null,9.1806315615423042,7.5233941381227325,6.511393263250425,5.9061942256432216,5.5969130029933751,"N/A","N/A",null,null,null,4,0.15,null,null,null,9.0731315615423043,7.4016163603449545,6.361532152139314,5.7127418446908402,5.3418435585489306,"N/A","N/A",null,null,null,4,0.15,null,null,null,8.4629063571575252,6.9492139746149091,6.0329097936605729,5.4960655374233482,5.2380504008009856,"N/A","N/A",null,null,null,4,0.15,null,null,null,8.3486347036142181,6.8197651557172705,5.8736086125582103,5.2904271797180611,4.9669135897773629,"N/A","N/A",null,null,null,4,0.15,null,null,null,3.8049667381203731,3.6342540073990559,3.5042425533928769,3.4192903237823153,3.3854119978244643,"N/A","N/A",null,null,null,4,0.15,null,null,null,6.5190577215494816,6.239602722673772,6.0058864444930293,5.8210989546223191,5.6900992528599872,5.6190788951790136,"N/A"]
[null,null,null,null,null,null,null,null,null,null,null,null,null,null,null,null,null,null,null,null,5,0.2,null,null,null,null,7.4948198503748724,6.4875813567938758,5.8988908806033988,5.6387470313970498,"N/A","N/A",null,null,null,5,0.2,null,null,null,null,7.3159309614859831,6.2901276530901713,5.6779054308679493,5.3888379705504885,"N/A","N/A",null,null,null,5,0.2,null,null,null,null,6.9445638603465421,6.0290346984369334,5.4986666337798784,5.2719434923061632,"N/A","N/A",null,null,null,5,0.2,null,null,null,null,6.7544063800315808,5.8191429661534695,5.2637608407540064,5.0062921284141506,"N/A","N/A",null,null,null,5,0.2,null,null,null,null,3.6533775054429927,3.5185080498756545,3.4304531051026723,3.4033605968420129,"N/A","N/A",null,null,null,5,0.2,null,null,null,null,6.2293824728144465,5.9888707376660824,5.7993564151606067,5.6728965077239986,5.6203936500114393,"N/A"]
[null,null,null,null,null,null,null,null,null,null,null,null,null,null,null,null,null,null,null,null,6,0.25,null,null,null,null,null,6.9585811238581545,6.5657636635406948,6.4475245762391067,"N/A","N/A",null,null,null,6,0.25,null,null,null,null,null,6.6683033460803767,6.2519541397311702,6.1047914413184721,"N/A","N/A",null,null,null,6,0.25,null,null,null,null,null,6.496398528325237,6.1457304782305817,6.0491951917153646,"N/A","N/A",null,null,null,6,0.25,null,null,null,null,null,6.1878355361992536,5.8121534253621903,5.6848725679808307,"N/A","N/A",null,null,null,6,0.25,null,null,null,null,null,3.6604270635012548,3.6261783776151915,"N/A","N/A","N/A",null,null,null,6,0.25,null,null,null,null,null,6.0851217960822606,5.9421890828524404,5.8591108716658429,"N/A","N/A"]
[null,null,null,null,null,null,null,null,null,null,null,null,null,null,null,null,null,null,null,null,7,0.3,null,null,null,null,null,null,"N/A","N/A","N/A","N/A",null,null,null,7,0.3,null,null,null,null,null,null,"N/A","N/A","N/A","N/A",null,null,null,7,0.3,null,null,null,null,null,null,"N/A","N/A","N/A","N/A",null,null,null,7,0.3,null,null,null,null,null,null,"N/A","N/A","N/A","N/A",null,null,null,7,0.3,null,null,null,null,null,null,"N/A","N/A","N/A","N/A",null,null,null,7,0.3,null,null,null,null,null,null,"N/A","N/A","N/A","N/A"]
[null,null,null,null,null,null,null,null,null,null,null,null,null,null,null,null,null,null,null,null,8,0.35,null,null,null,null,null,null,null,"N/A","N/A","N/A",null,null,null,8,0.35,null,null,null,null,null,null,null,"N/A","N/A","N/A",null,null,null,8,0.35,null,null,null,null,null,null,null,"N/A","N/A","N/A",null,null,null,8,0.35,null,null,null,null,null,null,null,"N/A","N/A","N/A",null,null,null,8,0.35,null,null,null,null,null,null,null,"N/A","N/A","N/A",null,null,null,8,0.35,null,null,null,null,null,null,null,"N/A","N/A","N/A"]
[null,null,null,null,null,null,null,null,null,null,null,null,null,null,null,null,null,null,null,null,9,0.4,null,null,null,null,null,null,null,null,"N/A","N/A",null,null,null,9,0.4,null,null,null,null,null,null,null,null,"N/A","N/A",null,null,null,9,0.4,null,null,null,null,null,null,null,null,"N/A","N/A",null,null,null,9,0.4,null,null,null,null,null,null,null,null,"N/A","N/A",null,null,null,9,0.4,null,null,null,null,null,null,null,null,"N/A","N/A",null,null,null,9,0.4,null,null,null,null,null,null,null,null,"N/A","N/A"]
[null,null,null,null,null,null,null,null,null,null,null,null,null,null,null,null,null,null,null,null,10,0.45,null,null,null,null,null,null,null,null,null,"N/A",null,null,null,10,0.45,null,null,null,null,null,null,null,null,null,"N/A",null,null,null,10,0.45,null,null,null,null,null,null,null,null,null,"N/A",null,null,null,10,0.45,null,null,null,null,null,null,null,null,null,"N/A",null,null,null,10,0.45,null,null,null,null,null,null,null,null,null,"N/A",null,null,null,10,0.45,null,null,null,null,null,null,null,null,null,"N/A"]
[]
[]
[null,null,null,null,null,null,null,null,null,null,null,null,null,null,null,null,null,null,null,50000,null,null,"niv.",null,null,null,null,null,null,null,null,null,null,null,50000,null,null,"niv.",null,null,null,null,null,null,null,null,null,null,null,50000,null,null,"niv.",null,null,null,null,null,null,null,null,null,null,null,50000,null,null,"niv.",null,null,null,null,null,null,null,null,null,null,null,50000,null,null,"niv.",null,null,null,null,null,null,null,null,null,null,null,50000,null,null,"niv."]
[null,null,null,null,null,null,null,null,null,null,null,null,null,null,null,null,null,null,null,null,null,"Perf.",1,2,3,4,5,6,7,8,9,10,null,null,null,null,"Perf.",1,2,3,4,5,6,7,8,9,10,null,null,null,null,"Perf.",1,2,3,4,5,6,7,8,9,10,null,null,null,null,"Perf.",1,2,3,4,5,6,7,8,9,10,null,null,null,null,"Perf.",1,2,3,4,5,6,7,8,9,10,null,null,null,null,"Perf.",1,2,3,4,5,6,7,8,9,10]
[null,null,null,null,null,null,null,null,null,null,null,null,null,null,null,null,null,null,null,"revenus /J",1,0,40,20.078472222222221,13.490277777777777,10.252083333333333,8.3805555555555546,7.2256944444444455,6.5184523809523816,6.1326388888888896,6.0055555555555555,"N/A",null,null,"revenus /J",1,0,40,20.062777777777775,13.45888888888889,10.201666666666666,8.3044444444444458,7.1138888888888889,6.3576190476190479,5.9061111111111124,5.6933333333333334,"N/A",null,null,"revenus /J",1,0,36.697247706422019,18.42709607543323,12.389360346585114,9.4263952599388379,7.7200050968399596,6.6752357288481141,6.046630624726955,5.719794852191642,5.6385830784913358,"N/A",null,null,"revenus /J",1,0,36.697247706422019,18.41041300456709,12.355994204852832,9.3728027402537979,7.6390995850289354,6.5563873036512632,5.8756660577978206,5.4789976080971527,5.3066933147118078,"N/A",null,null,"revenus /J",1,0,4.5480386583285961,4.2898661857578295,4.066975268076316,3.8765781374643606,3.7190475051666381,3.5971689655329548,3.515596022420115,3.4804464370581751,"N/A","N/A",null,null,"revenus /J",1,0,7.6537629007761394,7.2805874288162515,6.9484876834216855,6.6542743957023989,6.3975734071545416,6.1802435221688423,6.005933084506049,5.8797381838848128,5.8079363173469085,5.7977767613126439]
[null,null,null,null,null,null,null,null,null,null,null,null,null,null,null,null,null,null,null,20700,2,0.05,null,19.182817152562713,12.893174398004772,9.8042557985035792,8.0222935276917529,6.9271427545579431,6.262550932478236,5.9087251214740117,5.8065210956312203,"N/A",null,null,20700,2,0.05,null,19.151428263673822,12.851322546152922,9.7459919096146912,7.9399046388028642,6.810105717520905,6.0972334721607755,5.678273732585124,5.4908112190880116,"N/A",null,null,20700,2,0.05,null,17.61007796514463,11.844681606392713,9.0178862047945358,7.3931978527245192,6.4028963587519128,5.8131968789302118,5.5155403246194901,5.4570234984272012,"N/A",null,null,20700,2,0.05,null,17.576711823412346,11.800193417416336,8.9559521496764258,7.3056191125670376,6.2784869099330152,5.6374657203250367,5.2705723128084667,5.1214263855663091,"N/A",null,null,20700,2,0.05,null,4.2702162629086624,4.0392286401634934,3.8428858972017594,3.6812422261970918,3.5569122955668258,3.474473476465497,3.4400280673555628,"N/A","N/A",null,null,20700,2,0.05,null,7.2491361585156762,6.9044321227919943,6.6003361220534247,6.3360935641725273,6.1133310075429845,5.9355664747633634,5.8078358377354515,5.7364043959298288,5.7285418138289881]
[null,null,null,null,null,null,null,null,null,null,null,null,null,null,null,null,null,null,null,null,3,0.1,null,null,12.397156517423701,9.4322423880677757,7.7246827993431095,6.6791338142674066,6.0499718408006338,5.7227184162561109,5.6411818021041968,"N/A",null,null,null,3,0.1,null,null,12.334378739645924,9.3582840547344421,7.6297383548986648,6.5516338142674071,5.8756861265149203,5.4844198051450004,5.3184966169190124,"N/A",null,null,null,3,0.1,null,null,11.396322489066735,8.6816168668000522,7.1241823823289314,6.1787168000889237,5.6210429715047923,5.3474056556222491,5.3075704593185424,"N/A",null,null,null,3,0.1,null,null,11.32959020560217,8.6029997408158003,7.0232571854785375,6.0431853040259318,5.4357786295475368,5.0940961083781549,4.9645586482949202,"N/A",null,null,null,3,0.1,null,null,4.0181388251754493,3.8157394232227926,3.6498967249141514,3.523030095263044,3.4396211801627961,3.4057400686633166,"N/A","N/A",null,null,null,3,0.1,null,null,6.8663186634724438,6.5524206599535804,6.2807437819794387,6.052656086533533,5.871524316465953,5.7423064388809797,5.6712399589538069,5.6656007348643103]
[null,null,null,null,null,null,null,null,null,null,null,null,null,null,null,null,null,null,null,null,4,0.15,null,null,null,9.1806315615423042,7.5233941381227325,6.511393263250425,5.9061942256432216,5.5969130029933751,5.5293547680928761,"N/A",null,null,null,4,0.15,null,null,null,9.0731315615423043,7.4016163603449545,6.361532152139314,5.7127418446908402,5.3418435585489306,5.1917621755002834,"N/A",null,null,null,4,0.15,null,null,null,8.4629063571575252,6.9492139746149091,6.0329097936605729,5.4960655374233482,5.2380504008009856,5.2103657883663086,"N/A",null,null,null,4,0.15,null,null,null,8.3486347036142181,6.8197651557172705,5.8736086125582103,5.2904271797180611,4.9669135897773629,4.851507520649772,"N/A",null,null,null,4,0.15,null,null,null,3.8049667381203731,3.6342540073990559,3.5042425533928769,3.4192903237823153,3.3854119978244643,"N/A","N/A",null,null,null,4,0.15,null,null,null,6.5190577215494816,6.239602722673772,6.0058864444930293,5.8210989546223191,5.6900992528599872,5.6190788951790136,5.6189440093462331]
[null,null,null,null,null,null,null,null,null,null,null,null,null,null,null,null,null,null,null,null,5,0.2,null,null,null,null,7.4948198503748724,6.4875813567938758,5.8857840201090355,5.5790540731509619,"N/A","N/A",null,null,null,5,0.2,null,null,null,null,7.3159309614859831,6.2901276530901713,5.6515379883630041,5.288290184262074,"N/A","N/A",null,null,null,5,0.2,null,null,null,null,6.9445638603465421,6.0290346984369334,5.4927440272316579,5.2351440793832564,"N/A","N/A",null,null,null,5,0.2,null,null,null,null,6.7544063800315808,5.8191429661534695,5.2437423399425684,4.926064354973807,"N/A","N/A",null,null,null,5,0.2,null,null,null,null,3.6533775054429927,3.5185080498756545,3.4304531051026723,3.3951319318515769,"N/A","N/A",null,null,null,5,0.2,null,null,null,null,6.2293824728144465,5.9888707376660824,5.7993564151606067,5.6655686714427089,5.5943826592920161,"N/A"]
[null,null,null,null,null,null,null,null,null,null,null,null,null,null,null,null,null,null,null,null,6,0.25,null,null,null,null,null,6.7919144571914885,6.3038589016359321,6.1141912429057736,"N/A","N/A",null,null,null,6,0.25,null,null,null,null,null,6.5016366794137106,5.9900493778264092,5.7714581079851381,"N/A","N/A",null,null,null,6,0.25,null,null,null,null,null,6.3434933295484797,5.9054508801528192,5.7433847941618481,"N/A","N/A",null,null,null,6,0.25,null,null,null,null,null,6.0349303374224945,5.5718738272844277,5.3790621704273143,"N/A","N/A",null,null,null,6,0.25,null,null,null,null,null,3.6097685022043962,3.5503986687639157,"N/A","N/A","N/A",null,null,null,6,0.25,null,null,null,null,null,6.0404625904802094,5.8749671775737955,5.7686094566205579,5.7352929148905369,"N/A"]
[null,null,null,null,null,null,null,null,null,null,null,null,null,null,null,null,null,null,null,null,7,0.3,null,null,null,null,null,null,"N/A","N/A","N/A","N/A",null,null,null,7,0.3,null,null,null,null,null,null,"N/A","N/A","N/A","N/A",null,null,null,7,0.3,null,null,null,null,null,null,"N/A","N/A","N/A","N/A",null,null,null,7,0.3,null,null,null,null,null,null,"N/A","N/A","N/A","N/A",null,null,null,7,0.3,null,null,null,null,null,null,"N/A","N/A","N/A","N/A",null,null,null,7,0.3,null,null,null,null,null,null,"N/A","N/A","N/A","N/A"]
[null,null,null,null,null,null,null,null,null,null,null,null,null,null,null,null,null,null,null,null,8,0.35,null,null,null,null,null,null,null,"N/A","N/A","N/A",null,null,null,8,0.35,null,null,null,null,null,null,null,"N/A","N/A","N/A",null,null,null,8,0.35,null,null,null,null,null,null,null,"N/A","N/A","N/A",null,null,null,8,0.35,null,null,null,null,null,null,null,"N/A","N/A","N/A",null,null,null,8,0.35,null,null,null,null,null,null,null,"N/A","N/A","N/A",null,null,null,8,0.35,null,null,null,null,null,null,null,"N/A","N/A","N/A"]
[null,null,null,null,null,null,null,null,null,null,null,null,null,null,null,null,null,null,null,null,9,0.4,null,null,null,null,null,null,null,null,"N/A","N/A",null,null,null,9,0.4,null,null,null,null,null,null,null,null,"N/A","N/A",null,null,null,9,0.4,null,null,null,null,null,null,null,null,"N/A","N/A",null,null,null,9,0.4,null,null,null,null,null,null,null,null,"N/A","N/A",null,null,null,9,0.4,null,null,null,null,null,null,null,null,"N/A","N/A",null,null,null,9,0.4,null,null,null,null,null,null,null,null,"N/A","N/A"]
[null,null,null,null,null,null,null,null,null,null,null,null,null,null,null,null,null,null,null,null,10,0.45,null,null,null,null,null,null,null,null,null,"N/A",null,null,null,10,0.45,null,null,null,null,null,null,null,null,null,"N/A",null,null,null,10,0.45,null,null,null,null,null,null,null,null,null,"N/A",null,null,null,10,0.45,null,null,null,null,null,null,null,null,null,"N/A",null,null,null,10,0.45,null,null,null,null,null,null,null,null,null,"N/A",null,null,null,10,0.45,null,null,null,null,null,null,null,null,null,"N/A"]
[]
[]
[null,null,null,null,null,null,null,null,null,null,null,null,null,null,null,null,null,null,null,60000,null,null,"niv.",null,null,null,null,null,null,null,null,null,null,null,60000,null,null,"niv.",null,null,null,null,null,null,null,null,null,null,null,60000,null,null,"niv.",null,null,null,null,null,null,null,null,null,null,null,60000,null,null,"niv.",null,null,null,null,null,null,null,null,null,null,null,60000,null,null,"niv.",null,null,null,null,null,null,null,null,null,null,null,60000,null,null,"niv."]
[null,null,null,null,null,null,null,null,null,null,null,null,null,null,null,null,null,null,null,null,null,"Perf.",1,2,3,4,5,6,7,8,9,10,null,null,null,null,"Perf.",1,2,3,4,5,6,7,8,9,10,null,null,null,null,"Perf.",1,2,3,4,5,6,7,8,9,10,null,null,null,null,"Perf.",1,2,3,4,5,6,7,8,9,10,null,null,null,null,"Perf.",1,2,3,4,5,6,7,8,9,10,null,null,null,null,"Perf.",1,2,3,4,5,6,7,8,9,10]
[null,null,null,null,null,null,null,null,null,null,null,null,null,null,null,null,null,null,null,"revenus /J",1,0,40,20.078472222222221,13.490277777777777,10.252083333333333,8.3805555555555546,7.2256944444444455,6.5184523809523816,6.1326388888888896,6.0055555555555555,"N/A",null,null,"revenus /J",1,0,40,20.062777777777775,13.45888888888889,10.201666666666666,8.3044444444444458,7.1138888888888889,6.3576190476190479,5.9061111111111124,5.6933333333333334,"N/A",null,null,"revenus /J",1,0,36.697247706422019,18.42709607543323,12.389360346585114,9.4263952599388379,7.7200050968399596,6.6752357288481141,6.046630624726955,5.719794852191642,5.6385830784913358,"N/A",null,null,"revenus /J",1,0,36.697247706422019,18.41041300456709,12.355994204852832,9.3728027402537979,7.6390995850289354,6.5563873036512632,5.8756660577978206,5.4789976080971527,5.3066933147118078,"N/A",null,null,"revenus /J",1,0,4.5480386583285961,4.2898661857578295,4.066975268076316,3.8765781374643606,3.7190475051666381,3.5971689655329548,3.515596022420115,3.4804464370581751,"N/A","N/A",null,null,"revenus /J",1,0,7.6537629007761394,7.2805874288162515,6.9484876834216855,6.6542743957023989,6.3975734071545416,6.1802435221688423,6.005933084506049,5.8797381838848128,5.8079363173469085,5.7977767613126439]
[null,null,null,null,null,null,null,null,null,null,null,null,null,null,null,null,null,null,null,21600,2,0.05,null,19.182817152562713,12.893174398004772,9.8042557985035792,8.0222935276917529,6.9271427545579431,6.262550932478236,5.9087251214740117,5.8065210956312203,"N/A",null,null,21600,2,0.05,null,19.151428263673822,12.851322546152922,9.7459919096146912,7.9399046388028642,6.810105717520905,6.0972334721607755,5.678273732585124,5.4908112190880116,"N/A",null,null,21600,2,0.05,null,17.61007796514463,11.844681606392713,9.0178862047945358,7.3931978527245192,6.4028963587519128,5.8131968789302118,5.5155403246194901,5.4570234984272012,"N/A",null,null,21600,2,0.05,null,17.576711823412346,11.800193417416336,8.9559521496764258,7.3056191125670376,6.2784869099330152,5.6374657203250367,5.2705723128084667,5.1214263855663091,"N/A",null,null,21600,2,0.05,null,4.2702162629086624,4.0392286401634934,3.8428858972017594,3.6812422261970918,3.5569122955668258,3.474473476465497,3.4400280673555628,"N/A","N/A",null,null,21600,2,0.05,null,7.2491361585156762,6.9044321227919943,6.6003361220534247,6.3360935641725273,6.1133310075429845,5.9355664747633634,5.8078358377354515,5.7364043959298288,5.7285418138289881]
[null,null,null,null,null,null,null,null,null,null,null,null,null,null,null,null,null,null,null,null,3,0.1,null,null,12.397156517423701,9.4322423880677757,7.7246827993431095,6.6791338142674066,6.0499718408006338,5.7227184162561109,5.6411818021041968,"N/A",null,null,null,3,0.1,null,null,12.334378739645924,9.3582840547344421,7.6297383548986648,6.5516338142674071,5.8756861265149203,5.4844198051450004,5.3184966169190124,"N/A",null,null,null,3,0.1,null,null,11.396322489066735,8.6816168668000522,7.1241823823289314,6.1787168000889237,5.6210429715047923,5.3474056556222491,5.3075704593185424,"N/A",null,null,null,3,0.1,null,null,11.32959020560217,8.6029997408158003,7.0232571854785375,6.0431853040259318,5.4357786295475368,5.0940961083781549,4.9645586482949202,"N/A",null,null,null,3,0.1,null,null,4.0181388251754493,3.8157394232227926,3.6498967249141514,3.523030095263044,3.4396211801627961,3.4057400686633166,"N/A","N/A",null,null,null,3,0.1,null,null,6.8663186634724438,6.5524206599535804,6.2807437819794387,6.052656086533533,5.871524316465953,5.7423064388809797,5.6712399589538069,5.6656007348643103]
[null,null,null,null,null,null,null,null,null,null,null,null,null,null,null,null,null,null,null,null,4,0.15,null,null,null,9.1806315615423042,7.5233941381227325,6.511393263250425,5.9061942256432216,5.5969130029933751,5.5293547680928761,"N/A",null,null,null,4,0.15,null,null,null,9.0731315615423043,7.4016163603449545,6.361532152139314,5.7127418446908402,5.3418435585489306,5.1917621755002834,"N/A",null,null,null,4,0.15,null,null,null,8.4629063571575252,6.9492139746149091,6.0329097936605729,5.4960655374233482,5.2380504008009856,5.2103657883663086,"N/A",null,null,null,4,0.15,null,null,null,8.3486347036142181,6.8197651557172705,5.8736086125582103,5.2904271797180611,4.9669135897773629,4.851507520649772,"N/A",null,null,null,4,0.15,null,null,null,3.8049667381203731,3.6342540073990559,3.5042425533928769,3.4192903237823153,3.3854119978244643,"N/A","N/A",null,null,null,4,0.15,null,null,null,6.5190577215494816,6.239602722673772,6.0058864444930293,5.8210989546223191,5.6900992528599872,5.6190788951790136,5.6153038218454805]
[null,null,null,null,null,null,null,null,null,null,null,null,null,null,null,null,null,null,null,null,5,0.2,null,null,null,null,7.4948198503748724,6.4875813567938758,5.8857840201090355,5.5790540731509619,5.5134801637885094,"N/A",null,null,null,5,0.2,null,null,null,null,7.3159309614859831,6.2901276530901713,5.6515379883630041,5.288290184262074,5.1535370978423201,"N/A",null,null,null,5,0.2,null,null,null,null,6.9445638603465421,6.0290346984369334,5.4927440272316579,5.2351440793832564,5.2077823915505483,"N/A",null,null,null,5,0.2,null,null,null,null,6.7544063800315808,5.8191429661534695,5.2437423399425684,4.926064354973807,4.8151970897132781,"N/A",null,null,null,5,0.2,null,null,null,null,3.6533775054429927,3.5185080498756545,3.4304531051026723,3.3951319318515769,"N/A","N/A",null,null,null,5,0.2,null,null,null,null,6.2293824728144465,5.9888707376660824,5.7993564151606067,5.6655686714427089,5.5936270790791927,"N/A"]
[null,null,null,null,null,null,null,null,null,null,null,null,null,null,null,null,null,null,null,null,6,0.25,null,null,null,null,null,6.7051727093387363,6.1218790585450851,5.8607828283863546,"N/A","N/A",null,null,null,6,0.25,null,null,null,null,null,6.4148949315609585,5.8080695347355604,5.5180496934657199,"N/A","N/A",null,null,null,6,0.25,null,null,null,null,null,6.2649679173160715,5.7395510686194067,5.5119541831526817,"N/A","N/A",null,null,null,6,0.25,null,null,null,null,null,5.9564049251900872,5.4059740157510152,5.1476315594181488,"N/A","N/A",null,null,null,6,0.25,null,null,null,null,null,3.5944725537357236,3.5051761602882268,3.4792383773621718,"N/A","N/A",null,null,null,6,0.25,null,null,null,null,null,6.0269780996053548,5.8348516476080947,5.708369156178172,5.6557274730037559,"N/A"]
[null,null,null,null,null,null,null,null,null,null,null,null,null,null,null,null,null,null,null,null,7,0.3,null,null,null,null,null,null,11.789793447117846,11.789793447117846,"N/A","N/A",null,null,null,7,0.3,null,null,null,null,null,null,11.789793447117846,11.789793447117846,"N/A","N/A",null,null,null,7,0.3,null,null,null,null,null,null,11.56336020773529,11.56336020773529,"N/A","N/A",null,null,null,7,0.3,null,null,null,null,null,null,11.56336020773529,11.56336020773529,"N/A","N/A",null,null,null,7,0.3,null,null,null,null,null,null,"N/A","N/A","N/A","N/A",null,null,null,7,0.3,null,null,null,null,null,null,11.77798165975109,11.77798165975109,"N/A","N/A"]
[null,null,null,null,null,null,null,null,null,null,null,null,null,null,null,null,null,null,null,null,8,0.35,null,null,null,null,null,null,null,"N/A","N/A","N/A",null,null,null,8,0.35,null,null,null,null,null,null,null,"N/A","N/A","N/A",null,null,null,8,0.35,null,null,null,null,null,null,null,"N/A","N/A","N/A",null,null,null,8,0.35,null,null,null,null,null,null,null,"N/A","N/A","N/A",null,null,null,8,0.35,null,null,null,null,null,null,null,"N/A","N/A","N/A",null,null,null,8,0.35,null,null,null,null,null,null,null,"N/A","N/A","N/A"]
[null,null,null,null,null,null,null,null,null,null,null,null,null,null,null,null,null,null,null,null,9,0.4,null,null,null,null,null,null,null,null,"N/A","N/A",null,null,null,9,0.4,null,null,null,null,null,null,null,null,"N/A","N/A",null,null,null,9,0.4,null,null,null,null,null,null,null,null,"N/A","N/A",null,null,null,9,0.4,null,null,null,null,null,null,null,null,"N/A","N/A",null,null,null,9,0.4,null,null,null,null,null,null,null,null,"N/A","N/A",null,null,null,9,0.4,null,null,null,null,null,null,null,null,"N/A","N/A"]
[null,null,null,null,null,null,null,null,null,null,null,null,null,null,null,null,null,null,null,null,10,0.45,null,null,null,null,null,null,null,null,null,"N/A",null,null,null,10,0.45,null,null,null,null,null,null,null,null,null,"N/A",null,null,null,10,0.45,null,null,null,null,null,null,null,null,null,"N/A",null,null,null,10,0.45,null,null,null,null,null,null,null,null,null,"N/A",null,null,null,10,0.45,null,null,null,null,null,null,null,null,null,"N/A",null,null,null,10,0.45,null,null,null,null,null,null,null,null,null,"N/A"]
[]
[]
[null,null,null,null,null,null,null,null,null,null,null,null,null,null,null,null,null,null,null,null,null,null,null,null,null,null,null,null,null,null,null,null,null,null,70000,null,null,"niv.",null,null,null,null,null,null,null,null,null,null,null,70000,null,null,"niv.",null,null,null,null,null,null,null,null,null,null,null,70000,null,null,"niv.",null,null,null,null,null,null,null,null,null,null,null,70000,null,null,"niv.",null,null,null,null,null,null,null,null,null,null,null,70000,null,null,"niv."]
[null,null,null,null,null,null,null,null,null,null,null,null,null,null,null,null,null,null,null,null,null,null,null,null,null,null,null,null,null,null,null,null,null,null,null,null,"Perf.",1,2,3,4,5,6,7,8,9,10,null,null,null,null,"Perf.",1,2,3,4,5,6,7,8,9,10,null,null,null,null,"Perf.",1,2,3,4,5,6,7,8,9,10,null,null,null,null,"Perf.",1,2,3,4,5,6,7,8,9,10,null,null,null,null,"Perf.",1,2,3,4,5,6,7,8,9,10]
[null,null,null,null,null,null,null,null,null,null,null,null,null,null,null,null,null,null,null,null,null,null,null,null,null,null,null,null,null,null,null,null,null,null,"revenus /J",1,0,40,20.062777777777775,13.45888888888889,10.201666666666666,8.3044444444444458,7.1138888888888889,6.3576190476190479,5.9061111111111124,5.6933333333333334,5.6850000000000005,null,null,"revenus /J",1,0,36.697247706422019,18.42709607543323,12.389360346585114,9.4263952599388379,7.7200050968399596,6.6752357288481141,6.046630624726955,5.719794852191642,5.6385830784913358,"N/A",null,null,"revenus /J",1,0,36.697247706422019,18.41041300456709,12.355994204852832,9.3728027402537979,7.6390995850289354,6.5563873036512632,5.8756660577978206,5.4789976080971527,5.3066933147118078,"N/A",null,null,"revenus /J",1,0,4.5480386583285961,4.2898661857578295,4.066975268076316,3.8765781374643606,3.7190475051666381,3.5971689655329548,3.515596022420115,3.4804464370581751,"N/A","N/A",null,null,"revenus /J",1,0,7.6537629007761394,7.2805874288162515,6.9484876834216855,6.6542743957023989,6.3975734071545416,6.1802435221688423,6.005933084506049,5.8797381838848128,5.8079363173469085,5.7977767613126439]
[null,null,null,null,null,null,null,null,null,null,null,null,null,null,null,null,null,null,null,null,null,null,null,null,null,null,null,null,null,null,null,null,null,null,21600,2,0.05,null,19.151428263673822,12.851322546152922,9.7459919096146912,7.9399046388028642,6.810105717520905,6.0972334721607755,5.678273732585124,5.4908112190880116,"N/A",null,null,21600,2,0.05,null,17.61007796514463,11.844681606392713,9.0178862047945358,7.3931978527245192,6.4028963587519128,5.8131968789302118,5.5155403246194901,5.4570234984272012,"N/A",null,null,21600,2,0.05,null,17.576711823412346,11.800193417416336,8.9559521496764258,7.3056191125670376,6.2784869099330152,5.6374657203250367,5.2705723128084667,5.1214263855663091,"N/A",null,null,21600,2,0.05,null,4.2702162629086624,4.0392286401634934,3.8428858972017594,3.6812422261970918,3.5569122955668258,3.474473476465497,3.4400280673555628,"N/A","N/A",null,null,21600,2,0.05,null,7.2491361585156762,6.9044321227919943,6.6003361220534247,6.3360935641725273,6.1133310075429845,5.9355664747633634,5.8078358377354515,5.7364043959298288,5.7285418138289881]
[null,null,null,null,null,null,null,null,null,null,null,null,null,null,null,null,null,null,null,null,null,null,null,null,null,null,null,null,null,null,null,null,null,null,null,3,0.1,null,null,12.334378739645924,9.3582840547344421,7.6297383548986648,6.5516338142674071,5.8756861265149203,5.4844198051450004,5.3184966169190124,"N/A",null,null,null,3,0.1,null,null,11.396322489066735,8.6816168668000522,7.1241823823289314,6.1787168000889237,5.6210429715047923,5.3474056556222491,5.3075704593185424,"N/A",null,null,null,3,0.1,null,null,11.32959020560217,8.6029997408158003,7.0232571854785375,6.0431853040259318,5.4357786295475368,5.0940961083781549,4.9645586482949202,"N/A",null,null,null,3,0.1,null,null,4.0181388251754493,3.8157394232227926,3.6498967249141514,3.523030095263044,3.4396211801627961,3.4057400686633166,"N/A","N/A",null,null,null,3,0.1,null,null,6.8663186634724438,6.5524206599535804,6.2807437819794387,6.052656086533533,5.871524316465953,5.7423064388809797,5.6712399589538069,5.6656007348643103]
[null,null,null,null,null,null,null,null,null,null,null,null,null,null,null,null,null,null,null,null,null,null,null,null,null,null,null,null,null,null,null,null,null,null,null,4,0.15,null,null,null,9.0731315615423043,7.4016163603449545,6.361532152139314,5.7127418446908402,5.3418435585489306,5.1917621755002834,"N/A",null,null,null,4,0.15,null,null,null,8.4629063571575252,6.9492139746149091,6.0329097936605729,5.4960655374233482,5.2380504008009856,5.2103657883663086,"N/A",null,null,null,4,0.15,null,null,null,8.3486347036142181,6.8197651557172705,5.8736086125582103,5.2904271797180611,4.9669135897773629,4.851507520649772,"N/A",null,null,null,4,0.15,null,null,null,3.8049667381203731,3.6342540073990559,3.5042425533928769,3.4192903237823153,3.3854119978244643,"N/A","N/A",null,null,null,4,0.15,null,null,null,6.5190577215494816,6.239602722673772,6.0058864444930293,5.8210989546223191,5.6900992528599872,5.6190788951790136,5.6153038218454805]
[null,null,null,null,null,null,null,null,null,null,null,null,null,null,null,null,null,null,null,null,null,null,null,null,null,null,null,null,null,null,null,null,null,null,null,5,0.2,null,null,null,null,7.3159309614859831,6.2901276530901713,5.6515379883630041,5.288290184262074,5.1441591761341892,"N/A",null,null,null,5,0.2,null,null,null,null,6.9445638603465421,6.0290346984369334,5.4927440272316579,5.2351440793832564,5.2077823915505483,"N/A",null,null,null,5,0.2,null,null,null,null,6.7544063800315808,5.8191429661534695,5.2437423399425684,4.926064354973807,4.8151970897132781,"N/A",null,null,null,5,0.2,null,null,null,null,3.6533775054429927,3.5185080498756545,3.4304531051026723,3.3951319318515769,"N/A","N/A",null,null,null,5,0.2,null,null,null,null,6.2293824728144465,5.9888707376660824,5.7993564151606067,5.6655686714427089,5.5936270790791927,5.5907651821263373]
[null,null,null,null,null,null,null,null,null,null,null,null,null,null,null,null,null,null,null,null,null,null,null,null,null,null,null,null,null,null,null,null,null,null,null,6,0.25,null,null,null,null,null,6.4148949315609585,5.7584813699093926,5.3970329572109801,"N/A","N/A",null,null,null,6,0.25,null,null,null,null,null,6.2649679173160715,5.6949725005566334,5.4120939935426096,"N/A","N/A",null,null,null,6,0.25,null,null,null,null,null,5.9564049251900872,5.3613954476882411,5.0375221918796216,"N/A","N/A",null,null,null,6,0.25,null,null,null,null,null,3.5944725537357236,3.5001174875593515,3.4604459118371844,"N/A","N/A",null,null,null,6,0.25,null,null,null,null,null,6.0269780996053548,5.8303642508607219,5.6916047822085112,5.6209243581253663,"N/A"]
[null,null,null,null,null,null,null,null,null,null,null,null,null,null,null,null,null,null,null,null,null,null,null,null,null,null,null,null,null,null,null,null,null,null,null,7,0.3,null,null,null,null,null,null,12.339243996568396,12.339243996568396,"N/A","N/A",null,null,null,7,0.3,null,null,null,null,null,null,12.067443280625701,12.067443280625701,"N/A","N/A",null,null,null,7,0.3,null,null,null,null,null,null,12.067443280625701,12.067443280625701,"N/A","N/A",null,null,null,7,0.3,null,null,null,null,null,null,"N/A","N/A","N/A","N/A",null,null,null,7,0.3,null,null,null,null,null,null,12.353728518113963,12.353728518113963,"N/A","N/A"]
[null,null,null,null,null,null,null,null,null,null,null,null,null,null,null,null,null,null,null,null,null,null,null,null,null,null,null,null,null,null,null,null,null,null,null,8,0.35,null,null,null,null,null,null,null,"N/A","N/A","N/A",null,null,null,8,0.35,null,null,null,null,null,null,null,"N/A","N/A","N/A",null,null,null,8,0.35,null,null,null,null,null,null,null,"N/A","N/A","N/A",null,null,null,8,0.35,null,null,null,null,null,null,null,"N/A","N/A","N/A",null,null,null,8,0.35,null,null,null,null,null,null,null,6.2681118429566061,"N/A","N/A"]
[null,null,null,null,null,null,null,null,null,null,null,null,null,null,null,null,null,null,null,null,null,null,null,null,null,null,null,null,null,null,null,null,null,null,null,9,0.4,null,null,null,null,null,null,null,null,"N/A","N/A",null,null,null,9,0.4,null,null,null,null,null,null,null,null,"N/A","N/A",null,null,null,9,0.4,null,null,null,null,null,null,null,null,"N/A","N/A",null,null,null,9,0.4,null,null,null,null,null,null,null,null,"N/A","N/A",null,null,null,9,0.4,null,null,null,null,null,null,null,null,"N/A","N/A"]
[null,null,null,null,null,null,null,null,null,null,null,null,null,null,null,null,null,null,null,null,null,null,null,null,null,null,null,null,null,null,null,null,null,null,null,10,0.45,null,null,null,null,null,null,null,null,null,"N/A",null,null,null,10,0.45,null,null,null,null,null,null,null,null,null,"N/A",null,null,null,10,0.45,null,null,null,null,null,null,null,null,null,"N/A",null,null,null,10,0.45,null,null,null,null,null,null,null,null,null,"N/A",null,null,null,10,0.45,null,null,null,null,null,null,null,null,null,"N/A"]
[]
[]
[]
[]
[]
[]
[]
[]
[]
[]
[]
[]
[]
[]
[]
[]
[null,null,null,null,null,null,null,null,null,null,null,null,null,null,null,null,null,null,null,null,null,"Diagonale",null,null,null,null,null,"* (n'est pas comptabilisé dans la richesse)"]
[null,null,null,null,null,null,null,null,null,null,null,null,null,null,null,null,null,null,null,null,null,"PERF."]
[null,null,null,null,null,null,null,null,null,null,null,null,null,null,null,null,null,null,null,null,null,null,null,null,null,null,"Cumul","Cumul",null,null,null,"Revenus","Rich.",null,null,null,"Jours pour"]
[null,null,null,null,null,null,null,null,null,null,null,null,null,null,null,null,null,null,null,null,null,"Cout (min) du niv","Revenus (après)",null,null,"Heures","Heure","Jours","Débit","Manque","Crédit","externes","externe","Capital","Richesse",null,"rang"]
[null,null,null,null,null,null,null,null,null,null,null,null,null,null,null,null,null,null,null,null,null,null,2000,{"$f":"W151*($N$12+1)","v":2060},null,null,0,{"$f":"AA151/24","v":0},null,null,{"$f":"$N$19","v":2000},null,null,null,{"$f":"$N$9","v":0}]
[null,null,null,null,null,null,null,null,null,null,null,null,null,null,null,null,null,null,null,null,null,null,null,null,null,null,null,null,null,null,null,null,null,null,null,1,{"$f":"IF(AI152<$N$7,($N$7-AI151)/(X151+$N$15/4)+AB151,\"N/A\")","v":77.669902912621353}]
[null,null,null,null,null,null,null,null,null,null,null,null,null,null,null,null,null,null,null,null,null,1600,4200,{"$f":"W153*($N$12+1)","v":4326},"P2",{"$f":"$DK$47/(1+$N$11)","v":3.4556574923547396},{"$f":"Z153+AA152","v":3.4556574923547396},{"$f":"AA153/24","v":0.14398572884811414},{"$f":"V153","v":1600},null,{"$f":"$N$6/24*(X151+X153)/2","v":94.074664680360272},{"$f":"$N$13/24*Z153","v":0},{"$f":"$N$15/24*Z153/4","v":0},{"$f":"AE151-AC153+AE153","v":494.07466468036029},{"$f":"AI151+AE153+AG153","v":94.074664680360272}]
[null,null,null,null,null,null,null,null,null,null,null,null,null,null,null,null,null,null,null,null,null,null,null,null,null,{"$f":"AE154/X153*24","v":23.888628767376645},{"$f":"Z154+AA153","v":27.344286259731383},1.139345260822141,null,{"$f":"IF(V155-AH153>0,V155-AH153,0)","v":4305.92533531964},{"$f":"AD154","v":4305.92533531964},{"$f":"$N$13/24*Z154","v":0},{"$f":"$N$15/24*Z154/4","v":0},{"$f":"AH153-AC154+AE154+AF153","v":4800},{"$f":"AI153+AE154+AG154","v":4400},2,{"$f":"IF(AI154<$N$7,($N$7-AI153)/(X153+$N$15/4)+AB153,\"N/A\")","v":37.107907442976554}]
[null,null,null,null,null,null,null,null,null,null,null,null,null,null,null,null,null,null,null,null,null,4800,6600,{"$f":"W155*($N$12+1)","v":6798},"P3",{"$f":"$DK$48/(1+$N$11)","v":3.4556574923547396},30.799943752086122,1.2833309896702552,{"$f":"V155","v":4800},null,{"$f":"$N$6/24*(X153+X155)/2","v":163.8719965399824},0,{"$f":"$N$15/24*Z155/4","v":0},163.8719965399824,{"$f":"AI154+AE155+AG155","v":4563.8719965399823}]
[null,null,null,null,null,null,null,null,null,null,null,null,null,null,null,null,null,null,null,null,null,null,null,null,null,{"$f":"AE156/X155*24","v":33.313779359082147},64.113723111168269,2.6714051296320114,null,{"$f":"IF(V157-AH155>0,V157-AH155,0)","v":9436.1280034600168},{"$f":"AD156","v":9436.1280034600168},0,0,9600,14000,3,{"$f":"IF(AI156<$N$7,($N$7-AI155)/(X155+$N$15/4)+AB155,\"N/A\")","v":24.148310101682611}]
[null,null,null,null,null,null,null,null,null,null,null,null,null,null,null,null,null,null,null,null,null,9600,9200,{"$f":"W157*($N$12+1)","v":9476},"P4",{"$f":"$DK$49/(1+$N$11)","v":4.9235474006116204},69.037270511779894,2.8765529379908288,{"$f":"V157","v":9600},null,{"$f":"$N$6/24*(X155+X157)/2","v":239.73866160478909},0,0,239.73866160478909,14239.73866160479]
[null,null,null,null,null,null,null,null,null,null,null,null,null,null,null,null,null,null,null,null,null,null,null,null,null,{"$f":"AE158/X157*24","v":39.916238087957481},108.95350859973738,4.539729524989057,null,{"$f":"IF(V159-AH157>0,V159-AH157,0)","v":15760.26133839521},{"$f":"AD158","v":15760.26133839521},0,0,16000,30000,4,{"$f":"IF(AI158<$N$7,($N$7-AI157)/(X157+$N$15/4)+AB157,\"N/A\")","v":18.258598245968372}]
[null,null,null,null,null,null,null,null,null,null,null,null,null,null,null,null,null,null,null,null,null,16000,12000,{"$f":"W159*($N$12+1)","v":12360},"P5",{"$f":"$DK$50/(1+$N$11)","v":7.8593272171253812},116.81283581686276,4.8672014923692819,{"$f":"V159","v":16000},null,{"$f":"$N$6/24*(X157+X159)/2","v":321.67465987478028},0,0,321.67465987478028,30321.674659874781]
[null,null,null,null,null,null,null,null,null,null,null,null,null,null,null,null,null,null,null,null,null,null,null,null,null,{"$f":"AE160/X159*24","v":45.977330757524697},162.79016657438746,{"$f":"AA160/24","v":6.7829236072661443},null,{"$f":"IF(V161-AH159>0,V161-AH159,0)","v":23678.325340125219},{"$f":"AD160","v":23678.325340125219},0,0,24000,54000,5,{"$f":"IF(AI160<$N$7,($N$7-AI159)/(X159+$N$15/4)+AB159,\"N/A\")","v":15.358975387201419}]
[null,null,null,null,null,null,null,null,null,null,null,null,null,null,null,null,null,null,null,null,null,24000,15000,{"$f":"W161*($N$12+1)","v":15450},"P6",{"$f":"$DK$51/(1+$N$11)","v":12.262996941896024},175.05316351628349,{"$f":"AA161/24","v":7.2938818131784791},{"$f":"V161","v":24000},null,{"$f":"$N$6/24*(X159+X161)/2","v":409.67999134995603},0,0,409.67999134995603,54409.679991349956]
[null,null,null,null,null,null,null,null,null,null,null,null,null,null,null,null,null,null,null,null,null,null,null,null,null,{"$f":"AE162/X161*24","v":51.557778654213664},226.61094217049714,9.4421225904373802,null,{"$f":"IF(V163-AH161>0,V163-AH161,0)","v":33190.320008650044},{"$f":"AD162","v":33190.320008650044},0,0,33600,87600,6,{"$f":"IF(AI162<$N$7,($N$7-AI161)/(X161+$N$15/4)+AB161,\"N/A\")","v":14.128206732832204}]
[null,null,null,null,null,null,null,null,null,null,null,null,null,null,null,null,null,null,null,null,null,33600,18200,{"$f":"W163*($N$12+1)","v":18746},"P7",{"$f":"$DK$52/(1+$N$11)","v":18.134556574923547},244.74549874542069,10.197729114392528,{"$f":"V163","v":33600},null,{"$f":"$N$6/24*(X161+X163)/2","v":503.75465603031631},0,0,503.75465603031631,88103.754656030316]
[null,null,null,null,null,null,null,null,null,null,null,null,null,null,null,null,null,null,null,null,null,null,null,null,null,{"$f":"AE164/X163*24","v":56.711292449337051},301.45679119475773,12.560699633114906,null,{"$f":"IF(V165-AH163>0,V165-AH163,0)","v":44296.245343969684},{"$f":"AD164","v":44296.245343969684},0,0,44800,132400,7,{"$f":"IF(AI164<$N$7,($N$7-AI163)/(X163+$N$15/4)+AB163,\"N/A\")","v":14.033013726788223}]
[null,null,null,null,null,null,null,null,null,null,null,null,null,null,null,null,null,null,null,null,null,44800,21600,{"$f":"W165*($N$12+1)","v":22248},"P8",{"$f":"$DK$53/(1+$N$11)","v":25.474006116207953},326.93079731096566,13.622116554623569,44800,null,{"$f":"$N$6/24*(X163+X165)/2","v":603.89865391586113},0,0,603.89865391586113,133003.89865391585]
[null,null,null,null,null,null,null,null,null,null,null,null,null,null,null,null,null,null,null,null,null,null,null,null,null,{"$f":"AE166/X165*24","v":61.484467471503933},388.41526478246959,16.183969365936232,null,{"$f":"IF(V167-AH165>0,V167-AH165,0)","v":56996.101346084142},{"$f":"AD166","v":56996.101346084142},0,0,57600,190000,8,{"$f":"IF(AI166<$N$7,($N$7-AI165)/(X165+$N$15/4)+AB165,\"N/A\")","v":"N/A"}]
[null,null,null,null,null,null,null,null,null,null,null,null,null,null,null,null,null,null,null,null,null,57600,25200,{"$f":"W167*($N$12+1)","v":25956},"P9",{"$f":"$DK$54/(1+$N$11)","v":34.281345565749227},422.69661034821883,17.612358764509118,57600,null,{"$f":"$N$6/24*(X165+X167)/2","v":710.11198500659043},0,0,710.11198500659043,190710.1119850066]
[null,null,null,null,null,null,null,null,null,null,null,null,null,null,null,null,null,null,null,null,null,null,null,null,null,{"$f":"AE168/X167*24","v":65.917603342573656},488.6142136907925,20.358925570449689,null,{"$f":"IF(V169-AH167>0,V169-AH167,0)","v":71289.888014993412},{"$f":"AD168","v":71289.888014993412},0,0,72000,262000,9,{"$f":"IF(AI168<$N$7,($N$7-AI167)/(X167+$N$15/4)+AB167,\"N/A\")","v":"N/A"}]
[null,null,null,null,null,null,null,null,null,null,null,null,null,null,null,null,null,null,null,null,null,72000,29000,{"$f":"W169*($N$12+1)","v":29870},"P10",{"$f":"$DK$55/(1+$N$11)","v":44.556574923547394},533.17078861433993,22.215449525597496,72000,null,{"$f":"$N$6/24*(X167+X169)/2","v":822.39464930250426},0,0,822.39464930250426,262822.39464930253]
[null,null,null,null,null,null,null,null,null,null,null,null,null,null,null,null,null,null,null,null,null,null,null,null,null,null,null,null,null,null,null,null,null,null,262822.39464930253,10,{"$f":"IF(AI170<$N$7,($N$7-AI169)/(X169+$N$15/4)+AB169,\"N/A\")","v":"N/A"}]
[]
[null,null,null,null,null,null,null,null,null,null,null,null,null,null,null,null,null,null,null,null,null,"POUR UNE MINE D'OR",null,null,null,null,null,null,null,null,null,null,null,null,null,"min",{"$f":"MIN(AK152:AK170)","v":14.033013726788223}]
[null,null,null,null,null,null,null,null,null,null,null,null,null,null,null,null,null,null,null,null,null,"Ligne 1"]
[null,null,null,null,null,null,null,null,null,null,null,null,null,null,null,null,null,null,null,null,null,"PERF 0%"]
[null,null,null,null,null,null,null,null,null,null,null,null,null,null,null,null,null,null,null,null,null,null,null,null,null,null,"Cumul","Cumul",null,null,null,"Revenus","Rich.",null,null,null,"Jours pour"]
[null,null,null,null,null,null,null,null,null,null,null,null,null,null,null,null,null,null,null,null,null,"Cout (min) du niv","Revenus (après)","Revenus (après)",null,"Heures","Heure","Jours","Débit","Manque","Crédit","externes","externe","Capital","Richesse","niv","rang"]
[null,null,null,null,null,null,null,null,null,null,null,null,null,null,null,null,null,null,null,null,null,null,2000,{"$f":"W177*($N$12+1)","v":2060},null,null,0,{"$f":"AA177/24","v":0},null,null,{"$f":"$N$19","v":2000},null,null,null,{"$f":"$N$9","v":0}]
[null,null,null,null,null,null,null,null,null,null,null,null,null,null,null,null,null,null,null,null,null,null,null,null,null,null,null,null,null,null,null,null,null,null,null,1,{"$f":"IF(AI178<$N$7,($N$7-AI177)/(X177+$N$15/4)+AB177,\"N/A\")","v":77.669902912621353}]
[null,null,null,null,null,null,null,null,null,null,null,null,null,null,null,null,null,null,null,null,null,800,4000,{"$f":"W179*($N$12+1)","v":4120},"A2",{"$f":"$DK$47/(1+$N$11)","v":3.4556574923547396},{"$f":"Z179+AA178","v":3.4556574923547396},{"$f":"AA179/24","v":0.14398572884811414},{"$f":"V179","v":800},null,{"$f":"Z179/24*X177","v":296.61060142711511},{"$f":"$N$13/24*Z179","v":0},{"$f":"$N$15/24*Z179/4","v":0},{"$f":"AE177-AC179+AE179","v":1496.6106014271152},{"$f":"AI177+AE179+AG179","v":296.61060142711511}]
[null,null,null,null,null,null,null,null,null,null,null,null,null,null,null,null,null,null,null,null,null,null,null,null,null,{"$f":"AE180/X179*24","v":0.60226834120127082},{"$f":"Z180+AA179","v":4.0579258335560109},{"$f":"AA180/24","v":0.1690802430648338},null,{"$f":"IF(V181-AH179>0,V181-AH179,0)","v":103.38939857288483},{"$f":"AD180","v":103.38939857288483},0,{"$f":"$N$15/24*Z180/4","v":0},{"$f":"AH179-AC180+AE180+AF179","v":1600},{"$f":"AI179+AE180+AG180","v":399.99999999999994},2,{"$f":"IF(AI180<$N$7,($N$7-AI179)/(X179+$N$15/4)+AB179,\"N/A\")","v":38.906944320734738}]
[null,null,null,null,null,null,null,null,null,null,null,null,null,null,null,null,null,null,null,null,null,1600,6000,{"$f":"W181*($N$12+1)","v":6180},"A3",{"$f":"$DK$48/(1+$N$11)","v":3.4556574923547396},7.5135833259107505,0.31306597191294794,{"$f":"V181","v":1600},null,{"$f":"Z181/24*X179","v":593.22120285423023},0,{"$f":"$N$15/24*Z181/4","v":0},593.22120285423023,{"$f":"AI180+AE181+AG181","v":993.22120285423011}]
[null,null,null,null,null,null,null,null,null,null,null,null,null,null,null,null,null,null,null,null,null,null,null,null,null,{"$f":"AE182/X181*24","v":7.0166166879447367},14.530200013855488,{"$f":"AA182/24","v":0.60542500057731197},null,{"$f":"IF(V183-AH181>0,V183-AH181,0)","v":1806.7787971457697},{"$f":"AD182","v":1806.7787971457697},0,0,2400,2800,3,{"$f":"IF(AI182<$N$7,($N$7-AI181)/(X181+$N$15/4)+AB181,\"N/A\")","v":26.042318204460805},null,"la richesse n'augemente car, seulement 0,25 jours écoulés"]
[null,null,null,null,null,null,null,null,null,null,null,null,null,null,null,null,null,null,null,null,null,2400,8000,{"$f":"W183*($N$12+1)","v":8240},"A4",{"$f":"$DK$49/(1+$N$11)","v":4.9235474006116204},19.453747414467109,0.8105728089361296,{"$f":"V183","v":2400},null,{"$f":"Z183/24*X181","v":1267.8134556574923},0,0,1267.8134556574923,4067.8134556574923]
[null,null,null,null,null,null,null,null,null,null,null,null,null,null,null,null,null,null,null,null,null,null,null,null,null,{"$f":"AE184/X183*24","v":7.957824886434488},27.411572300901597,{"$f":"AA184/24","v":1.1421488458708999},null,{"$f":"IF(V185-AH183>0,V185-AH183,0)","v":2732.1865443425077},{"$f":"AD184","v":2732.1865443425077},0,0,4000,6800,4,{"$f":"IF(AI184<$N$7,($N$7-AI183)/(X183+$N$15/4)+AB183,\"N/A\")","v":19.734381855579638}]
[null,null,null,null,null,null,null,null,null,null,null,null,null,null,null,null,null,null,null,null,null,4000,10000,{"$f":"W185*($N$12+1)","v":10300},"A5",{"$f":"$DK$50/(1+$N$11)","v":7.8593272171253812},35.27089951802698,1.4696208132511241,{"$f":"V185","v":4000},null,{"$f":"Z185/24*X183","v":2698.3690112130475},0,0,2698.3690112130475,9498.369011213048]
[null,null,null,null,null,null,null,null,null,null,null,null,null,null,null,null,null,null,null,null,null,null,null,null,null,{"$f":"AE186/X185*24","v":8.6251595855229972},43.896059103549973,{"$f":"AA186/24","v":1.8290024626479156},null,{"$f":"IF(V187-AH185>0,V187-AH185,0)","v":3701.6309887869525},{"$f":"AD186","v":3701.6309887869525},0,0,6400,13200,5,{"$f":"IF(AI186<$N$7,($N$7-AI185)/(X185+$N$15/4)+AB185,\"N/A\")","v":16.081429647113936}]
[null,null,null,null,null,null,null,null,null,null,null,null,null,null,null,null,null,null,null,null,null,6400,12000,{"$f":"W187*($N$12+1)","v":12360},"A6",{"$f":"$DK$51/(1+$N$11)","v":12.262996941896024},56.159056045445993,2.3399606685602499,{"$f":"V187","v":6400},null,{"$f":"Z187/24*X185","v":5262.8695208970439},0,0,5262.8695208970439,18462.869520897046]
[null,null,null,null,null,null,null,null,null,null,null,null,null,null,null,null,null,null,null,null,null,null,null,null,null,{"$f":"AE188/X187*24","v":9.9750106390348652},66.134066684480857,{"$f":"AA188/24","v":2.7555861118533689},null,{"$f":"IF(V189-AH187>0,V189-AH187,0)","v":5137.1304791029561},{"$f":"AD188","v":5137.1304791029561},0,0,10400,23600,6,{"$f":"IF(AI188<$N$7,($N$7-AI187)/(X187+$N$15/4)+AB187,\"N/A\")","v":13.791184817354988}]
[null,null,null,null,null,null,null,null,null,null,null,null,null,null,null,null,null,null,null,null,null,10400,14000,{"$f":"W189*($N$12+1)","v":14420},"A7",{"$f":"$DK$52/(1+$N$11)","v":18.134556574923547},84.268623259404407,3.5111926358085168,{"$f":"V189","v":10400},null,{"$f":"Z189/24*X187","v":9339.2966360856262},0,0,9339.2966360856262,32939.296636085623]
[null,null,null,null,null,null,null,null,null,null,null,null,null,null,null,null,null,null,null,null,null,null,null,null,null,{"$f":"AE190/X189*24","v":12.417259412894936},96.685882672299343,4.0285784446791393,null,{"$f":"IF(V191-AH189>0,V191-AH189,0)","v":7460.7033639143738},{"$f":"AD190","v":7460.7033639143738},0,0,16800,40400,7,{"$f":"IF(AI190<$N$7,($N$7-AI189)/(X189+$N$15/4)+AB189,\"N/A\")","v":12.322614505705491}]
[null,null,null,null,null,null,null,null,null,null,null,null,null,null,null,null,null,null,null,null,null,16800,16000,{"$f":"W191*($N$12+1)","v":16480},"A8",{"$f":"$DK$53/(1+$N$11)","v":25.474006116207953},122.15988878850729,5.0899953661878037,{"$f":"V191","v":16800},null,{"$f":"Z191/24*X189","v":15305.632008154944},0,0,15305.632008154944,55705.632008154942]
[null,null,null,null,null,null,null,null,null,null,null,null,null,null,null,null,null,null,null,null,null,null,null,null,null,{"$f":"AE192/X191*24","v":17.321895133754936},139.48178392226222,5.8117409967609257,null,{"$f":"IF(V193-AH191>0,V193-AH191,0)","v":11894.367991845056},{"$f":"AD192","v":11894.367991845056},0,0,27200,67600,8,{"$f":"IF(AI192<$N$7,($N$7-AI191)/(X191+$N$15/4)+AB191,\"N/A\")","v":11.418537113265781}]
[null,null,null,null,null,null,null,null,null,null,null,null,null,null,null,null,null,null,null,null,null,27200,18000,{"$f":"W193*($N$12+1)","v":18540},"A9",{"$f":"$DK$54/(1+$N$11)","v":34.281345565749227},173.76312948801146,7.2401303953338108,{"$f":"V193","v":27200},null,{"$f":"Z193/24*X191","v":23539.857288481133},0,0,23539.857288481133,91139.857288481129]
[null,null,null,null,null,null,null,null,null,null,null,null,null,null,null,null,null,null,null,null,null,null,null,null,null,{"$f":"AE194/X193*24","v":26.485621633034128},200.24875112104559,8.3436979633768988,null,{"$f":"IF(V195-AH193>0,V195-AH193,0)","v":20460.142711518867},{"$f":"AD194","v":20460.142711518867},0,0,44000,111600,9,{"$f":"IF(AI194<$N$7,($N$7-AI193)/(X193+$N$15/4)+AB193,\"N/A\")","v":10.954269700162229}]
[null,null,null,null,null,null,null,null,null,null,null,null,null,null,null,null,null,null,null,null,null,44000,20000,{"$f":"W195*($N$12+1)","v":20600},"A10",{"$f":"$DK$55/(1+$N$11)","v":44.556574923547394},244.80532604459299,10.200221918524708,{"$f":"V195","v":44000},null,{"$f":"Z195/24*X193","v":34419.95412844036},0,0,34419.95412844036,146019.95412844035]
[null,null,null,null,null,null,null,null,null,null,null,null,null,null,null,null,null,null,null,null,null,null,null,null,null,null,null,null,null,null,null,null,null,null,146019.95412844035,10,{"$f":"IF(AI196<$N$7,($N$7-AI195)/(X195+$N$15/4)+AB195,\"N/A\")","v":10.878864921998478}]
[]
[null,null,null,null,null,null,null,null,null,null,null,null,null,null,null,null,null,null,null,null,null,null,null,null,null,null,null,null,null,null,null,null,null,null,null,"min",{"$f":"MIN(AK178:AK196)","v":10.878864921998478}]
[]
[null,null,null,null,null,null,null,null,null,null,null,null,null,null,null,null,null,null,null,null,null,"Ligne 2"]
[null,null,null,null,null,null,null,null,null,null,null,null,null,null,null,null,null,null,null,null,null,"PERF 5%"]
[null,null,null,null,null,null,null,null,null,null,null,null,null,null,null,null,null,null,null,null,null,null,null,null,null,null,"Cumul","Cumul",null,null,null,"Revenus","Rich.",null,null,null,"Jours pour"]
[null,null,null,null,null,null,null,null,null,null,null,null,null,null,null,null,null,null,null,null,null,"Cout (min) du niv","Revenus (après)","Revenus (après)",null,"Heures","Heure","Jours","Débit","Manque","Crédit","externes","externe","Capital","Richesse","niv","rang"]
[null,null,null,null,null,null,null,null,null,null,null,null,null,null,null,null,null,null,null,null,1,null,2000,{"$f":"W204*($N$12+1)","v":2060},null,null,0,{"$f":"AA204/24","v":0},null,null,{"$f":"$N$19","v":2000},null,null,null,{"$f":"$N$9","v":0}]
[null,null,null,null,null,null,null,null,null,null,null,null,null,null,null,null,null,null,null,null,null,null,null,null,null,null,null,null,null,null,null,null,null,null,null,1,{"$f":"IF(AI205<$N$7,($N$7-AI204)/(X204+$N$15/4)+AB204,\"N/A\")","v":77.669902912621353}]
[null,null,null,null,null,null,null,null,null,null,null,null,null,null,null,null,null,null,null,null,2,1600,4200,{"$f":"W206*($N$12+1)","v":4326},"P2",{"$f":"$DK$47/(1+$N$11)","v":3.4556574923547396},{"$f":"Z206+AA205","v":3.4556574923547396},{"$f":"AA206/24","v":0.14398572884811414},{"$f":"V206","v":1600},null,{"$f":"$N$6/24*(X204+X206)/2","v":94.074664680360272},{"$f":"$N$13/24*Z206","v":0},{"$f":"$N$15/24*Z206/4","v":0},{"$f":"AE204-AC206+AE206","v":494.07466468036029},{"$f":"AI204+AE206+AG206","v":94.074664680360272}]
[null,null,null,null,null,null,null,null,null,null,null,null,null,null,null,null,null,null,null,null,null,null,null,null,null,{"$f":"AE207/X206*24","v":6.1355081016346169},{"$f":"Z207+AA206","v":9.5911655939893556},{"$f":"AA207/24","v":0.39963189974955649},null,{"$f":"IF(V208-AH206>0,V208-AH206,0)","v":1105.9253353196398},{"$f":"AD207","v":1105.9253353196398},0,{"$f":"$N$15/24*Z207/4","v":0},{"$f":"AH206-AC207+AE207+AF206","v":1600},{"$f":"AI206+AE207+AG207","v":1200},2,{"$f":"IF(AI207<$N$7,($N$7-AI206)/(X206+$N$15/4)+AB206,\"N/A\")","v":37.107907442976554}]
[null,null,null,null,null,null,null,null,null,null,null,null,null,null,null,null,null,null,null,null,3,1600,6300,{"$f":"W208*($N$12+1)","v":6489},"A3",{"$f":"$DK$48/(1+$N$11)","v":3.4556574923547396},13.046823086344094,{"$f":"AA208/24","v":0.5436176285976706},{"$f":"V208","v":1600},null,{"$f":"Z208/24*X206","v":622.88226299694179},0,{"$f":"$N$15/24*Z208/4","v":0},622.88226299694179,{"$f":"AI207+AE208+AG208","v":1822.8822629969418}]
[null,null,null,null,null,null,null,null,null,null,null,null,null,null,null,null,null,null,null,null,null,null,null,null,null,{"$f":"AE209/X208*24","v":6.5727886713011863},19.619611757645281,0.81748382323522006,null,{"$f":"IF(V210-AH208>0,V210-AH208,0)","v":1777.1177370030582},{"$f":"AD209","v":1777.1177370030582},0,0,2400,3600,3,{"$f":"IF(AI209<$N$7,($N$7-AI208)/(X208+$N$15/4)+AB208,\"N/A\")","v":24.91981083818359}]
[null,null,null,null,null,null,null,null,null,null,null,null,null,null,null,null,null,null,null,null,4,2400,8400,{"$f":"W210*($N$12+1)","v":8652},"A4",{"$f":"$DK$49/(1+$N$11)","v":4.9235474006116204},24.543159158256902,1.0226316315940376,{"$f":"V210","v":2400},null,{"$f":"Z210/24*X208","v":1331.204128440367},0,0,1331.204128440367,4931.2041284403667]
[null,null,null,null,null,null,null,null,null,null,null,null,null,null,null,null,null,null,null,null,null,null,null,null,null,{"$f":"AE211/X210*24","v":7.4030398656300509},31.946199023886955,{"$f":"AA211/24","v":1.3310916259952899},null,{"$f":"IF(V212-AH210>0,V212-AH210,0)","v":2668.7958715596333},{"$f":"AD211","v":2668.7958715596333},0,0,4000,7600,4,{"$f":"IF(AI211<$N$7,($N$7-AI210)/(X210+$N$15/4)+AB210,\"N/A\")","v":18.945516036536208}]
[null,null,null,null,null,null,null,null,null,null,null,null,null,null,null,null,null,null,null,null,5,4000,10500,{"$f":"W212*($N$12+1)","v":10815},"A5",{"$f":"$DK$50/(1+$N$11)","v":7.8593272171253812},39.805526241012338,{"$f":"AA212/24","v":1.6585635933755141},{"$f":"V212","v":4000},null,{"$f":"Z212/24*X210","v":2833.2874617736998},0,0,2833.2874617736998,10433.2874617737]
[null,null,null,null,null,null,null,null,null,null,null,null,null,null,null,null,null,null,null,null,null,null,null,null,null,{"$f":"AE213/X212*24","v":7.9150347588933148},47.720560999905651,1.988356708329402,null,{"$f":"IF(V214-AH212>0,V214-AH212,0)","v":3566.7125382263002},{"$f":"AD213","v":3566.7125382263002},0,0,6400,14000,5,{"$f":"IF(AI213<$N$7,($N$7-AI212)/(X212+$N$15/4)+AB212,\"N/A\")","v":15.488125547904069}]
[null,null,null,null,null,null,null,null,null,null,null,null,null,null,null,null,null,null,null,null,6,6400,12600,{"$f":"W214*($N$12+1)","v":12978},"A6",{"$f":"$DK$51/(1+$N$11)","v":12.262996941896024},59.983557941801678,2.4993149142417366,{"$f":"V214","v":6400},null,{"$f":"Z214/24*X212","v":5526.0129969418958},0,0,5526.0129969418958,19526.012996941896]
[null,null,null,null,null,null,null,null,null,null,null,null,null,null,null,null,null,null,null,null,null,null,null,null,null,{"$f":"AE215/X214*24","v":9.0133832696405065},68.996941211442191,2.8748725504767578,null,{"$f":"IF(V216-AH214>0,V216-AH214,0)","v":4873.9870030581042},{"$f":"AD215","v":4873.9870030581042},0,0,10400,24400,6,{"$f":"IF(AI215<$N$7,($N$7-AI214)/(X214+$N$15/4)+AB214,\"N/A\")","v":13.323323775627012}]
[null,null,null,null,null,null,null,null,null,null,null,null,null,null,null,null,null,null,null,null,7,10400,14700,{"$f":"W216*($N$12+1)","v":15141},"A7",{"$f":"$DK$52/(1+$N$11)","v":18.134556574923547},87.131497786365742,3.6304790744319058,{"$f":"V216","v":10400},null,{"$f":"Z216/24*X214","v":9806.2614678899081},0,0,9806.2614678899081,34206.261467889912]
[null,null,null,null,null,null,null,null,null,null,null,null,null,null,null,null,null,null,null,null,null,null,null,null,null,{"$f":"AE217/X216*24","v":11.085775362964283},98.217273149330026,4.0923863812220844,null,{"$f":"IF(V218-AH216>0,V218-AH216,0)","v":6993.7385321100919},{"$f":"AD217","v":6993.7385321100919},0,0,16800,41200,7,{"$f":"IF(AI217<$N$7,($N$7-AI216)/(X216+$N$15/4)+AB216,\"N/A\")","v":11.938631675456282}]
[null,null,null,null,null,null,null,null,null,null,null,null,null,null,null,null,null,null,null,null,8,16800,16800,{"$f":"W218*($N$12+1)","v":17304},"A8",{"$f":"$DK$53/(1+$N$11)","v":25.474006116207953},123.69127926553799,5.1538033027307497,{"$f":"V218","v":16800},null,{"$f":"Z218/24*X216","v":16070.913608562691},0,0,16070.913608562691,57270.913608562689]
[null,null,null,null,null,null,null,null,null,null,null,null,null,null,null,null,null,null,null,null,null,null,null,null,null,{"$f":"AE219/X218*24","v":15.435626063019846},139.12690532855783,5.7969543886899091,null,{"$f":"IF(V220-AH218>0,V220-AH218,0)","v":11129.086391437309},{"$f":"AD219","v":11129.086391437309},0,0,27200,68400,8,{"$f":"IF(AI219<$N$7,($N$7-AI218)/(X218+$N$15/4)+AB218,\"N/A\")","v":11.090528128865593}]
[null,null,null,null,null,null,null,null,null,null,null,null,null,null,null,null,null,null,null,null,9,27200,18900,{"$f":"W220*($N$12+1)","v":19467},"A9",{"$f":"$DK$54/(1+$N$11)","v":34.281345565749227},173.40825089430706,7.2253437872627941,{"$f":"V220","v":27200},null,{"$f":"Z220/24*X218","v":24716.85015290519},0,0,24716.85015290519,93116.850152905186]
[null,null,null,null,null,null,null,null,null,null,null,null,null,null,null,null,null,null,null,null,null,null,null,null,null,{"$f":"AE221/X220*24","v":23.773339309101324},197.18159020340838,8.2158995918086823,null,{"$f":"IF(V222-AH220>0,V222-AH220,0)","v":19283.14984709481},{"$f":"AD221","v":19283.14984709481},0,0,44000,112400,9,{"$f":"IF(AI221<$N$7,($N$7-AI220)/(X220+$N$15/4)+AB220,\"N/A\")","v":10.661063202020836}]
[null,null,null,null,null,null,null,null,null,null,null,null,null,null,null,null,null,null,null,null,10,44000,21000,{"$f":"W222*($N$12+1)","v":21630},"A10",{"$f":"$DK$55/(1+$N$11)","v":44.556574923547394},241.73816512695578,10.072423546956491,{"$f":"V222","v":44000},null,{"$f":"Z222/24*X220","v":36140.951834862382},0,0,36140.951834862382,148540.95183486238]
[null,null,null,null,null,null,null,null,null,null,null,null,null,null,null,null,null,null,null,null,null,null,null,null,null,null,null,null,null,null,null,null,null,null,148540.95183486238,10,{"$f":"IF(AI223<$N$7,($N$7-AI222)/(X222+$N$15/4)+AB222,\"N/A\")","v":10.602199236514402}]
[]
[null,null,null,null,null,null,null,null,null,null,null,null,null,null,null,null,null,null,null,null,null,null,null,null,null,null,null,null,null,null,null,null,null,null,null,"min",{"$f":"MIN(AK205:AK223)","v":10.602199236514402}]
[]
[null,null,null,null,null,null,null,null,null,null,null,null,null,null,null,null,null,null,null,null,null,"Ligne 3"]
[null,null,null,null,null,null,null,null,null,null,null,null,null,null,null,null,null,null,null,null,null,"PERF 10%"]
[null,null,null,null,null,null,null,null,null,null,null,null,null,null,null,null,null,null,null,null,null,null,null,null,null,null,"Cumul","Cumul",null,null,null,"Revenus","Rich.",null,null,null,"Jours pour"]
[null,null,null,null,null,null,null,null,null,null,null,null,null,null,null,null,null,null,null,null,null,"Cout (min) du niv","Revenus (après)","Revenus (après)",null,"Temps","Heure","Jours","Débit","Manque","Crédit","externes","externe","Capital","Richesse","niv","rang"]
[null,null,null,null,null,null,null,null,null,null,null,null,null,null,null,null,null,null,null,null,1,null,2000,{"$f":"W231*($N$12+1)","v":2060},null,null,0,{"$f":"AA231/24","v":0},null,null,{"$f":"$N$19","v":2000},null,null,null,{"$f":"$N$9","v":0}]
[null,null,null,null,null,null,null,null,null,null,null,null,null,null,null,null,null,null,null,null,null,null,null,null,null,null,null,null,null,null,null,null,null,null,null,1,{"$f":"IF(AI232<$N$7,($N$7-AI231)/(X231+$N$15/4)+AB231,\"N/A\")","v":77.669902912621353}]
[null,null,null,null,null,null,null,null,null,null,null,null,null,null,null,null,null,null,null,null,2,1600,4200,{"$f":"W233*($N$12+1)","v":4326},"P2",{"$f":"$DK$47/(1+$N$11)","v":3.4556574923547396},{"$f":"Z233+AA232","v":3.4556574923547396},{"$f":"AA233/24","v":0.14398572884811414},{"$f":"V233","v":1600},null,{"$f":"$N$6/24*(X231+X233)/2","v":94.074664680360272},{"$f":"$N$13/24*Z233","v":0},{"$f":"$N$15/24*Z233/4","v":0},{"$f":"AE231-AC233+AE233","v":494.07466468036029},{"$f":"AI231+AE233+AG233","v":94.074664680360272}]
[null,null,null,null,null,null,null,null,null,null,null,null,null,null,null,null,null,null,null,null,null,null,null,null,null,{"$f":"AE234/X233*24","v":23.888628767376645},{"$f":"Z234+AA233","v":27.344286259731383},1.139345260822141,null,{"$f":"IF(V235-AH233>0,V235-AH233,0)","v":4305.92533531964},{"$f":"AD234","v":4305.92533531964},0,{"$f":"$N$15/24*Z234/4","v":0},{"$f":"AH233-AC234+AE234+AF233","v":4800},{"$f":"AI233+AE234+AG234","v":4400},2,{"$f":"IF(AI234<$N$7,($N$7-AI233)/(X233+$N$15/4)+AB233,\"N/A\")","v":37.107907442976554}]
[null,null,null,null,null,null,null,null,null,null,null,null,null,null,null,null,null,null,null,null,3,4800,6600,{"$f":"W235*($N$12+1)","v":6798},"P3",{"$f":"$DK$48/(1+$N$11)","v":3.4556574923547396},30.799943752086122,1.2833309896702552,{"$f":"V235","v":4800},null,{"$f":"$N$6/24*(X233+X235)/2","v":163.8719965399824},0,{"$f":"$N$15/24*Z235/4","v":0},163.8719965399824,{"$f":"AI234+AE235+AG235","v":4563.8719965399823}]
[null,null,null,null,null,null,null,null,null,null,null,null,null,null,null,null,null,null,null,null,null,null,null,null,null,{"$f":"AE236/X235*24","v":7.8945384058606098},38.69448215794673,1.6122700899144471,null,{"$f":"IF(V237-AH235>0,V237-AH235,0)","v":2236.1280034600177},{"$f":"AD236","v":2236.1280034600177},0,0,2400,6800,3,{"$f":"IF(AI236<$N$7,($N$7-AI235)/(X235+$N$15/4)+AB235,\"N/A\")","v":24.148310101682611}]
[null,null,null,null,null,null,null,null,null,null,null,null,null,null,null,null,null,null,null,null,4,2400,8800,{"$f":"W237*($N$12+1)","v":9064},"A4",{"$f":"$DK$49/(1+$N$11)","v":4.9235474006116204},43.618029558558348,1.8174178982732645,{"$f":"V237","v":2400},null,{"$f":"Z237/24*X235","v":1394.5948012232416},0,0,1394.5948012232416,8194.594801223242]
[null,null,null,null,null,null,null,null,null,null,null,null,null,null,null,null,null,null,null,null,null,null,null,null,null,{"$f":"AE238/X237*24","v":6.8986898467169251},50.516719405275275,2.1048633085531363,null,{"$f":"IF(V239-AH237>0,V239-AH237,0)","v":2605.4051987767584},{"$f":"AD238","v":2605.4051987767584},0,0,4000,10800,4,{"$f":"IF(AI238<$N$7,($N$7-AI237)/(X237+$N$15/4)+AB237,\"N/A\")","v":18.565587050830274}]
[null,null,null,null,null,null,null,null,null,null,null,null,null,null,null,null,null,null,null,null,5,4000,11000,{"$f":"W239*($N$12+1)","v":11330},"A5",{"$f":"$DK$50/(1+$N$11)","v":7.8593272171253812},58.376046622400658,2.4323352759333607,{"$f":"V239","v":4000},null,{"$f":"Z239/24*X237","v":2968.2059123343524},0,0,2968.2059123343524,13768.205912334353]
[null,null,null,null,null,null,null,null,null,null,null,null,null,null,null,null,null,null,null,null,null,null,null,null,null,{"$f":"AE240/X239*24","v":7.2694667346845137},65.645513357085179,2.7352297232118823,null,{"$f":"IF(V241-AH239>0,V241-AH239,0)","v":3431.7940876656476},{"$f":"AD240","v":3431.7940876656476},0,0,6400,17200,5,{"$f":"IF(AI240<$N$7,($N$7-AI239)/(X239+$N$15/4)+AB239,\"N/A\")","v":15.338936695850894}]
[null,null,null,null,null,null,null,null,null,null,null,null,null,null,null,null,null,null,null,null,6,6400,13200,{"$f":"W241*($N$12+1)","v":13596},"A6",{"$f":"$DK$51/(1+$N$11)","v":12.262996941896024},77.908510298981199,3.2461879291242166,{"$f":"V241","v":6400},null,{"$f":"Z241/24*X239","v":5789.1564729867478},0,0,5789.1564729867478,22989.156472986746]
[null,null,null,null,null,null,null,null,null,null,null,null,null,null,null,null,null,null,null,null,null,null,null,null,null,{"$f":"AE242/X241*24","v":8.1391765701910899},86.047686869172281,3.5853202862155116,null,{"$f":"IF(V243-AH241>0,V243-AH241,0)","v":4610.8435270132522},{"$f":"AD242","v":4610.8435270132522},0,0,10400,27600,6,{"$f":"IF(AI242<$N$7,($N$7-AI241)/(X241+$N$15/4)+AB241,\"N/A\")","v":13.323478568063114}]
[null,null,null,null,null,null,null,null,null,null,null,null,null,null,null,null,null,null,null,null,7,10400,15400,{"$f":"W243*($N$12+1)","v":15862},"A7",{"$f":"$DK$52/(1+$N$11)","v":18.134556574923547},104.18224344409583,4.34092681017066,{"$f":"V243","v":10400},null,{"$f":"Z243/24*X241","v":10273.22629969419},0,0,10273.22629969419,37873.226299694186]
[null,null,null,null,null,null,null,null,null,null,null,null,null,null,null,null,null,null,null,null,null,null,null,null,null,{"$f":"AE244/X243*24","v":9.8753353175727803},114.05757876166861,4.7523991150695251,null,{"$f":"IF(V245-AH243>0,V245-AH243,0)","v":6526.7737003058101},{"$f":"AD244","v":6526.7737003058101},0,0,16800,44400,7,{"$f":"IF(AI244<$N$7,($N$7-AI243)/(X243+$N$15/4)+AB243,\"N/A\")","v":12.040256888364192}]
[null,null,null,null,null,null,null,null,null,null,null,null,null,null,null,null,null,null,null,null,8,16800,17600,{"$f":"W245*($N$12+1)","v":18128},"A8",{"$f":"$DK$53/(1+$N$11)","v":25.474006116207953},139.53158487787655,5.8138160365781895,{"$f":"V245","v":16800},null,{"$f":"Z245/24*X243","v":16836.195208970439},0,0,16836.195208970439,61236.195208970443]
[null,null,null,null,null,null,null,null,null,null,null,null,null,null,null,null,null,null,null,null,null,null,null,null,null,{"$f":"AE246/X245*24","v":13.720835998715216},153.25242087659177,6.3855175365246568,null,{"$f":"IF(V247-AH245>0,V247-AH245,0)","v":10363.804791029561},{"$f":"AD246","v":10363.804791029561},0,0,27200,71600,8,{"$f":"IF(AI246<$N$7,($N$7-AI245)/(X245+$N$15/4)+AB245,\"N/A\")","v":11.261951781890941}]
[null,null,null,null,null,null,null,null,null,null,null,null,null,null,null,null,null,null,null,null,9,27200,19800,{"$f":"W247*($N$12+1)","v":20394},"A9",{"$f":"$DK$54/(1+$N$11)","v":34.281345565749227},187.533766442341,7.8139069350975419,{"$f":"V247","v":27200},null,{"$f":"Z247/24*X245","v":25893.843017329247},0,0,25893.843017329247,97493.843017329244]
[null,null,null,null,null,null,null,null,null,null,null,null,null,null,null,null,null,null,null,null,null,null,null,null,null,{"$f":"AE248/X247*24","v":21.307628105526042},208.84139454786705,8.7017247728277933,null,{"$f":"IF(V249-AH247>0,V249-AH247,0)","v":18106.156982670753},{"$f":"AD248","v":18106.156982670753},0,0,44000,115600,9,{"$f":"IF(AI248<$N$7,($N$7-AI247)/(X247+$N$15/4)+AB247,\"N/A\")","v":10.878835687802786}]
[null,null,null,null,null,null,null,null,null,null,null,null,null,null,null,null,null,null,null,null,10,44000,22000,{"$f":"W249*($N$12+1)","v":22660},"A10",{"$f":"$DK$55/(1+$N$11)","v":44.556574923547394},253.39796947141446,10.558248727975602,{"$f":"V249","v":44000},null,{"$f":"Z249/24*X247","v":37861.949541284397},0,0,37861.949541284397,153461.94954128441]
[null,null,null,null,null,null,null,null,null,null,null,null,null,null,null,null,null,null,null,null,null,null,null,null,null,null,null,null,null,null,null,null,null,null,153461.94954128441,10,{"$f":"IF(AI250<$N$7,($N$7-AI249)/(X249+$N$15/4)+AB249,\"N/A\")","v":10.846776991820068}]
[]
[null,null,null,null,null,null,null,null,null,null,null,null,null,null,null,null,null,null,null,null,null,null,null,null,null,null,null,null,null,null,null,null,null,null,null,"min",{"$f":"MIN(AK232:AK250)","v":10.846776991820068}]
[]
[null,null,null,null,null,null,null,null,null,null,null,null,null,null,null,null,null,null,null,null,null,"Ligne 4"]
[null,null,null,null,null,null,null,null,null,null,null,null,null,null,null,null,null,null,null,null,null,"PERF 15%"]
[null,null,null,null,null,null,null,null,null,null,null,null,null,null,null,null,null,null,null,null,null,null,null,null,null,null,"Cumul","Cumul",null,null,null,"Revenus","Rich.",null,null,null,"Jours pour"]
[null,null,null,null,null,null,null,null,null,null,null,null,null,null,null,null,null,null,null,null,null,"Cout (min) du niv","Revenus (après)","Revenus (après)",null,"Temps","Heure","Jours","Débit","Manque","Crédit","externes","externe","Capital","Richesse","niv","rang"]
[null,null,null,null,null,null,null,null,null,null,null,null,null,null,null,null,null,null,null,null,1,null,2000,2000,null,null,0,{"$f":"AA258/24","v":0},null,null,{"$f":"$N$19","v":2000},null,null,null,{"$f":"$N$9","v":0}]
[null,null,null,null,null,null,null,null,null,null,null,null,null,null,null,null,null,null,null,null,null,null,null,null,null,null,null,null,null,null,null,null,null,null,null,1,{"$f":"IF(AI259<$N$7,($N$7-AI258)/(X258+$N$15/4)+AB258,\"N/A\")","v":80}]
[null,null,null,null,null,null,null,null,null,null,null,null,null,null,null,null,null,null,null,null,2,1600,4200,{"$f":"W260*($N$12+1)","v":4326},"P2",{"$f":"$DK$47/(1+$N$11)","v":3.4556574923547396},{"$f":"Z260+AA259","v":3.4556574923547396},{"$f":"AA260/24","v":0.14398572884811414},{"$f":"V260","v":1600},null,{"$f":"$N$6/24*(X258+X260)/2","v":93.19078120387708},{"$f":"$N$13/24*Z260","v":0},{"$f":"$N$15/24*Z260/4","v":0},{"$f":"AE258-AC260+AE260","v":493.19078120387707},{"$f":"AI258+AE260+AG260","v":93.19078120387708}]
[null,null,null,null,null,null,null,null,null,null,null,null,null,null,null,null,null,null,null,null,null,null,null,null,null,{"$f":"AE261/X260*24","v":23.893532420505537},{"$f":"Z261+AA260","v":27.349189912860275},1.1395495797025115,null,{"$f":"IF(V262-AH260>0,V262-AH260,0)","v":4306.8092187961229},{"$f":"AD261","v":4306.8092187961229},0,{"$f":"$N$15/24*Z261/4","v":0},{"$f":"AH260-AC261+AE261+AF260","v":4800},{"$f":"AI260+AE261+AG261","v":4400},2,{"$f":"IF(AI261<$N$7,($N$7-AI260)/(X260+$N$15/4)+AB260,\"N/A\")","v":37.108111761856925}]
[null,null,null,null,null,null,null,null,null,null,null,null,null,null,null,null,null,null,null,null,3,4800,6600,{"$f":"W262*($N$12+1)","v":6798},"P3",{"$f":"$DK$48/(1+$N$11)","v":3.4556574923547396},30.804847405215014,1.2835353085506256,{"$f":"V262","v":4800},null,{"$f":"$N$6/24*(X260+X262)/2","v":163.8719965399824},0,{"$f":"$N$15/24*Z262/4","v":0},163.8719965399824,{"$f":"AI261+AE262+AG262","v":4563.8719965399823}]
[null,null,null,null,null,null,null,null,null,null,null,null,null,null,null,null,null,null,null,null,null,null,null,null,null,{"$f":"AE263/X262*24","v":33.313779359082147},64.118626764297161,2.6716094485123816,null,{"$f":"IF(V264-AH262>0,V264-AH262,0)","v":9436.1280034600168},{"$f":"AD263","v":9436.1280034600168},0,0,9600,14000,3,{"$f":"IF(AI263<$N$7,($N$7-AI262)/(X262+$N$15/4)+AB262,\"N/A\")","v":24.148514420562982}]
[null,null,null,null,null,null,null,null,null,null,null,null,null,null,null,null,null,null,null,null,4,9600,9200,{"$f":"W264*($N$12+1)","v":9476},"P4",{"$f":"$DK$49/(1+$N$11)","v":4.9235474006116204},69.042174164908786,2.8767572568711994,{"$f":"V264","v":9600},null,{"$f":"$N$6/24*(X262+X264)/2","v":239.73866160478909},0,0,239.73866160478909,14239.73866160479]
[null,null,null,null,null,null,null,null,null,null,null,null,null,null,null,null,null,null,null,null,null,null,null,null,null,{"$f":"AE265/X264*24","v":9.5236673830186849},78.565841547927477,3.273576731163645,null,{"$f":"IF(V266-AH264>0,V266-AH264,0)","v":3760.2613383952107},{"$f":"AD265","v":3760.2613383952107},0,0,4000,18000,4,{"$f":"IF(AI265<$N$7,($N$7-AI264)/(X264+$N$15/4)+AB264,\"N/A\")","v":18.258802564848743}]
[null,null,null,null,null,null,null,null,null,null,null,null,null,null,null,null,null,null,null,null,5,4000,11500,{"$f":"W266*($N$12+1)","v":11845},"A5",{"$f":"$DK$50/(1+$N$11)","v":7.8593272171253812},86.425168765052859,3.601048698543869,{"$f":"V266","v":4000},null,{"$f":"Z266/24*X264","v":3103.1243628950047},0,0,3103.1243628950047,21103.124362895003]
[null,null,null,null,null,null,null,null,null,null,null,null,null,null,null,null,null,null,null,null,null,null,null,null,null,{"$f":"AE267/X266*24","v":6.6800350604069134},93.105203825459768,3.8793834927274902,null,{"$f":"IF(V268-AH266>0,V268-AH266,0)","v":3296.8756371049953},{"$f":"AD267","v":3296.8756371049953},0,0,6400,24400,5,{"$f":"IF(AI267<$N$7,($N$7-AI266)/(X266+$N$15/4)+AB266,\"N/A\")","v":15.327251791587768}]
[null,null,null,null,null,null,null,null,null,null,null,null,null,null,null,null,null,null,null,null,6,6400,13800,{"$f":"W268*($N$12+1)","v":14214},"A6",{"$f":"$DK$51/(1+$N$11)","v":12.262996941896024},105.36820076735579,4.3903416986398245,{"$f":"V268","v":6400},null,{"$f":"Z268/24*X266","v":6052.2999490315997},0,0,6052.2999490315997,30452.2999490316]
[null,null,null,null,null,null,null,null,null,null,null,null,null,null,null,null,null,null,null,null,null,null,null,null,null,{"$f":"AE269/X268*24","v":7.3409878446068388},112.70918861196263,4.6962161921651093,null,{"$f":"IF(V270-AH268>0,V270-AH268,0)","v":4347.7000509684003},{"$f":"AD269","v":4347.7000509684003},0,0,10400,34800,6,{"$f":"IF(AI269<$N$7,($N$7-AI268)/(X268+$N$15/4)+AB268,\"N/A\")","v":13.504433442763112}]
[null,null,null,null,null,null,null,null,null,null,null,null,null,null,null,null,null,null,null,null,7,10400,16100,{"$f":"W270*($N$12+1)","v":16583},"A7",{"$f":"$DK$52/(1+$N$11)","v":18.134556574923547},130.84374518688617,5.4518227161202573,{"$f":"V270","v":10400},null,{"$f":"Z270/24*X268","v":10740.191131498472},0,0,10740.191131498472,45540.191131498475]
[null,null,null,null,null,null,null,null,null,null,null,null,null,null,null,null,null,null,null,null,null,null,null,null,null,{"$f":"AE271/X270*24","v":8.7701509283022769},139.61389611518845,5.8172456714661855,null,{"$f":"IF(V272-AH270>0,V272-AH270,0)","v":6059.8088685015282},{"$f":"AD271","v":6059.8088685015282},0,0,16800,51600,7,{"$f":"IF(AI271<$N$7,($N$7-AI270)/(X270+$N$15/4)+AB270,\"N/A\")","v":12.354060481814132}]
[null,null,null,null,null,null,null,null,null,null,null,null,null,null,null,null,null,null,null,null,8,16800,18400,{"$f":"W272*($N$12+1)","v":18952},"A8",{"$f":"$DK$53/(1+$N$11)","v":25.474006116207953},165.08790223139641,6.8786625929748508,{"$f":"V272","v":16800},null,{"$f":"Z272/24*X270","v":17601.476809378186},0,0,17601.476809378186,69201.47680937819]
[null,null,null,null,null,null,null,null,null,null,null,null,null,null,null,null,null,null,null,null,null,null,null,null,null,{"$f":"AE273/X272*24","v":12.15515811391534},177.24306034531176,7.3851275143879898,null,{"$f":"IF(V274-AH272>0,V274-AH272,0)","v":9598.5231906218141},{"$f":"AD273","v":9598.5231906218141},0,0,27200,78800,8,{"$f":"IF(AI273<$N$7,($N$7-AI272)/(X272+$N$15/4)+AB272,\"N/A\")","v":11.669635745709222}]
[null,null,null,null,null,null,null,null,null,null,null,null,null,null,null,null,null,null,null,null,9,27200,20700,{"$f":"W274*($N$12+1)","v":21321},"A9",{"$f":"$DK$54/(1+$N$11)","v":34.281345565749227},211.524405911061,8.8135169129608748,{"$f":"V274","v":27200},null,{"$f":"Z274/24*X272","v":27070.835881753304},0,0,27070.835881753304,105870.8358817533]
[null,null,null,null,null,null,null,null,null,null,null,null,null,null,null,null,null,null,null,null,null,null,null,null,null,{"$f":"AE275/X274*24","v":19.056326571826869},230.58073248288787,9.6075305201203278,null,{"$f":"IF(V276-AH274>0,V276-AH274,0)","v":16929.164118246696},{"$f":"AD275","v":16929.164118246696},0,0,44000,122800,9,{"$f":"IF(AI275<$N$7,($N$7-AI274)/(X274+$N$15/4)+AB274,\"N/A\")","v":11.352289208737185}]
[null,null,null,null,null,null,null,null,null,null,null,null,null,null,null,null,null,null,null,null,10,44000,23000,{"$f":"W276*($N$12+1)","v":23690},"A10",{"$f":"$DK$55/(1+$N$11)","v":44.556574923547394},275.13730740643524,11.464054475268135,{"$f":"V276","v":44000},null,{"$f":"Z276/24*X274","v":39582.947247706419},0,0,39582.947247706419,162382.94724770641]
[null,null,null,null,null,null,null,null,null,null,null,null,null,null,null,null,null,null,null,null,null,null,null,null,null,null,null,null,null,null,null,null,null,null,162382.94724770641,10,{"$f":"IF(AI277<$N$7,($N$7-AI276)/(X276+$N$15/4)+AB276,\"N/A\")","v":"N/A"}]
[]
[null,null,null,null,null,null,null,null,null,null,null,null,null,null,null,null,null,null,null,null,null,null,null,null,null,null,null,null,null,null,null,null,null,null,null,"min",{"$f":"MIN(AK259:AK277)","v":11.352289208737185}]
[]
[null,null,null,null,null,null,null,null,null,null,null,null,null,null,null,null,null,null,null,null,null,"Ligne 5"]
[null,null,null,null,null,null,null,null,null,null,null,null,null,null,null,null,null,null,null,null,null,"PERF 20%"]
[null,null,null,null,null,null,null,null,null,null,null,null,null,null,null,null,null,null,null,null,null,null,null,null,null,null,"Cumul","Cumul",null,null,null,"Revenus","Rich.",null,null,null,"Jours pour"]
[null,null,null,null,null,null,null,null,null,null,null,null,null,null,null,null,null,null,null,null,null,"Cout (min) du niv","Revenus (après)","Revenus (après)",null,"Temps","Heure","Jours","Débit","Manque","Crédit","externes","externe","Capital","Richesse","niv","rang"]
[null,null,null,null,null,null,null,null,null,null,null,null,null,null,null,null,null,null,null,null,1,null,2000,2000,null,null,0,{"$f":"AA285/24","v":0},null,null,{"$f":"$N$19","v":2000},null,null,null,{"$f":"$N$9","v":0}]
[null,null,null,null,null,null,null,null,null,null,null,null,null,null,null,null,null,null,null,null,null,null,null,null,null,null,null,null,null,null,null,null,null,null,null,1,{"$f":"IF(AI286<$N$7,($N$7-AI285)/(X285+$N$15/4)+AB285,\"N/A\")","v":80}]
[null,null,null,null,null,null,null,null,null,null,null,null,null,null,null,null,null,null,null,null,2,1600,4200,{"$f":"W287*($N$12+1)","v":4326},"P2",{"$f":"$DK$47/(1+$N$11)","v":3.4556574923547396},{"$f":"Z287+AA286","v":3.4556574923547396},{"$f":"AA287/24","v":0.14398572884811414},{"$f":"V287","v":1600},null,{"$f":"$N$6/24*(X285+X287)/2","v":93.19078120387708},{"$f":"$N$13/24*Z287","v":0},{"$f":"$N$15/24*Z287/4","v":0},{"$f":"AE285-AC287+AE287","v":493.19078120387707},{"$f":"AI285+AE287+AG287","v":93.19078120387708}]
[null,null,null,null,null,null,null,null,null,null,null,null,null,null,null,null,null,null,null,null,null,null,null,null,null,{"$f":"AE288/X287*24","v":23.893532420505537},{"$f":"Z288+AA287","v":27.349189912860275},1.1395495797025115,null,{"$f":"IF(V289-AH287>0,V289-AH287,0)","v":4306.8092187961229},{"$f":"AD288","v":4306.8092187961229},0,{"$f":"$N$15/24*Z288/4","v":0},{"$f":"AH287-AC288+AE288+AF287","v":4800},{"$f":"AI287+AE288+AG288","v":4400},2,{"$f":"IF(AI288<$N$7,($N$7-AI287)/(X287+$N$15/4)+AB287,\"N/A\")","v":37.108111761856925}]
[null,null,null,null,null,null,null,null,null,null,null,null,null,null,null,null,null,null,null,null,3,4800,6600,{"$f":"W289*($N$12+1)","v":6798},"P3",{"$f":"$DK$48/(1+$N$11)","v":3.4556574923547396},30.804847405215014,1.2835353085506256,{"$f":"V289","v":4800},null,{"$f":"$N$6/24*(X287+X289)/2","v":163.8719965399824},0,{"$f":"$N$15/24*Z289/4","v":0},163.8719965399824,{"$f":"AI288+AE289+AG289","v":4563.8719965399823}]
[null,null,null,null,null,null,null,null,null,null,null,null,null,null,null,null,null,null,null,null,null,null,null,null,null,{"$f":"AE290/X289*24","v":33.313779359082147},64.118626764297161,2.6716094485123816,null,{"$f":"IF(V291-AH289>0,V291-AH289,0)","v":9436.1280034600168},{"$f":"AD290","v":9436.1280034600168},0,0,9600,14000,3,{"$f":"IF(AI290<$N$7,($N$7-AI289)/(X289+$N$15/4)+AB289,\"N/A\")","v":24.148514420562982}]
[null,null,null,null,null,null,null,null,null,null,null,null,null,null,null,null,null,null,null,null,4,9600,9200,{"$f":"W291*($N$12+1)","v":9476},"P4",{"$f":"$DK$49/(1+$N$11)","v":4.9235474006116204},69.042174164908786,2.8767572568711994,{"$f":"V291","v":9600},null,{"$f":"$N$6/24*(X289+X291)/2","v":239.73866160478909},0,0,239.73866160478909,14239.73866160479]
[null,null,null,null,null,null,null,null,null,null,null,null,null,null,null,null,null,null,null,null,null,null,null,null,null,{"$f":"AE292/X291*24","v":39.916238087957481},108.95841225286627,4.5399338438694281,null,{"$f":"IF(V293-AH291>0,V293-AH291,0)","v":15760.26133839521},{"$f":"AD292","v":15760.26133839521},0,0,16000,30000,4,{"$f":"IF(AI292<$N$7,($N$7-AI291)/(X291+$N$15/4)+AB291,\"N/A\")","v":18.258802564848743}]
[null,null,null,null,null,null,null,null,null,null,null,null,null,null,null,null,null,null,null,null,5,16000,12000,{"$f":"W293*($N$12+1)","v":12360},"P5",{"$f":"$DK$50/(1+$N$11)","v":7.8593272171253812},116.81773946999165,4.8674058112496521,{"$f":"V293","v":16000},null,{"$f":"$N$6/24*(X291+X293)/2","v":321.67465987478028},0,0,321.67465987478028,30321.674659874781]
[null,null,null,null,null,null,null,null,null,null,null,null,null,null,null,null,null,null,null,null,null,null,null,null,null,{"$f":"AE294/X293*24","v":11.8025734759713},128.62031294596295,5.3591797060817896,null,{"$f":"IF(V295-AH293>0,V295-AH293,0)","v":6078.3253401252196},{"$f":"AD294","v":6078.3253401252196},0,0,6400,36400,5,{"$f":"IF(AI294<$N$7,($N$7-AI293)/(X293+$N$15/4)+AB293,\"N/A\")","v":15.35917970608179}]
[null,null,null,null,null,null,null,null,null,null,null,null,null,null,null,null,null,null,null,null,6,6400,14400,{"$f":"W295*($N$12+1)","v":14832},"A6",{"$f":"$DK$51/(1+$N$11)","v":12.262996941896024},140.88330988785899,5.8701379119941244,{"$f":"V295","v":6400},null,{"$f":"Z295/24*X293","v":6315.4434250764525},0,0,6315.4434250764525,42715.443425076453]
[null,null,null,null,null,null,null,null,null,null,null,null,null,null,null,null,null,null,null,null,null,null,null,null,null,{"$f":"AE296/X295*24","v":6.6093148461546072},147.49262473401359,6.1455260305838992,null,{"$f":"IF(V297-AH295>0,V297-AH295,0)","v":4084.5565749235475},{"$f":"AD296","v":4084.5565749235475},0,0,10400,46800,6,{"$f":"IF(AI296<$N$7,($N$7-AI295)/(X295+$N$15/4)+AB295,\"N/A\")","v":13.777672740400511}]
[null,null,null,null,null,null,null,null,null,null,null,null,null,null,null,null,null,null,null,null,7,10400,16800,{"$f":"W297*($N$12+1)","v":17304},"A7",{"$f":"$DK$52/(1+$N$11)","v":18.134556574923547},165.62718130893714,6.9011325545390472,{"$f":"V297","v":10400},null,{"$f":"Z297/24*X295","v":11207.155963302752},0,0,11207.155963302752,58007.15596330275]
[null,null,null,null,null,null,null,null,null,null,null,null,null,null,null,null,null,null,null,null,null,null,null,null,null,{"$f":"AE298/X297*24","v":7.7570652381376526},173.38424654707478,7.2243436061281159,null,{"$f":"IF(V299-AH297>0,V299-AH297,0)","v":5592.8440366972482},{"$f":"AD298","v":5592.8440366972482},0,0,16800,63600,7,{"$f":"IF(AI298<$N$7,($N$7-AI297)/(X297+$N$15/4)+AB297,\"N/A\")","v":12.795309856706016}]
[null,null,null,null,null,null,null,null,null,null,null,null,null,null,null,null,null,null,null,null,8,16800,19200,{"$f":"W299*($N$12+1)","v":19776},"A8",{"$f":"$DK$53/(1+$N$11)","v":25.474006116207953},198.85825266328274,8.2857605276367803,{"$f":"V299","v":16800},null,{"$f":"Z299/24*X297","v":18366.758409785933},0,0,18366.758409785933,81966.758409785936]
[null,null,null,null,null,null,null,null,null,null,null,null,null,null,null,null,null,null,null,null,null,null,null,null,null,{"$f":"AE300/X299*24","v":10.719953386182121},209.57820604946485,8.7324252520610361,null,{"$f":"IF(V301-AH299>0,V301-AH299,0)","v":8833.2415902140674},{"$f":"AD300","v":8833.2415902140674},0,0,27200,90800,8,{"$f":"IF(AI300<$N$7,($N$7-AI299)/(X299+$N$15/4)+AB299,\"N/A\")","v":12.231616190572362}]
[null,null,null,null,null,null,null,null,null,null,null,null,null,null,null,null,null,null,null,null,9,27200,21600,{"$f":"W301*($N$12+1)","v":22248},"A9",{"$f":"$DK$54/(1+$N$11)","v":34.281345565749227},243.85955161521409,10.16081465063392,{"$f":"V301","v":27200},null,{"$f":"Z301/24*X299","v":28247.828746177362},0,0,28247.828746177362,119047.82874617736]
[null,null,null,null,null,null,null,null,null,null,null,null,null,null,null,null,null,null,null,null,null,null,null,null,null,{"$f":"AE302/X301*24","v":16.992633499269296},260.8521851144834,10.868841046436808,null,{"$f":"IF(V303-AH301>0,V303-AH301,0)","v":15752.171253822638},{"$f":"AD302","v":15752.171253822638},0,0,44000,134800,9,{"$f":"IF(AI302<$N$7,($N$7-AI301)/(X301+$N$15/4)+AB301,\"N/A\")","v":12.001527130579202}]
[null,null,null,null,null,null,null,null,null,null,null,null,null,null,null,null,null,null,null,null,10,44000,24000,{"$f":"W303*($N$12+1)","v":24720},"A10",{"$f":"$DK$55/(1+$N$11)","v":44.556574923547394},305.40876003803078,12.725365001584615,{"$f":"V303","v":44000},null,{"$f":"Z303/24*X301","v":41303.944954128434},0,0,41303.944954128434,176103.94495412844]
[null,null,null,null,null,null,null,null,null,null,null,null,null,null,null,null,null,null,null,null,null,null,null,null,null,null,null,null,null,null,null,null,null,null,176103.94495412844,10,{"$f":"IF(AI304<$N$7,($N$7-AI303)/(X303+$N$15/4)+AB303,\"N/A\")","v":"N/A"}]
[]
[null,null,null,null,null,null,null,null,null,null,null,null,null,null,null,null,null,null,null,null,null,null,null,null,null,null,null,null,null,null,null,null,null,null,null,"min",{"$f":"MIN(AK286:AK304)","v":12.001527130579202}]
[null,null,null,null,null,null,null,null,null,null,null,null,null,null,null,null,null,null,null,null,null,"Ligne 6"]
[null,null,null,null,null,null,null,null,null,null,null,null,null,null,null,null,null,null,null,null,null,"PERF 25%"]
[null,null,null,null,null,null,null,null,null,null,null,null,null,null,null,null,null,null,null,null,null,null,null,null,null,null,"Cumul","Cumul",null,null,null,"Revenus","Rich.",null,null,null,"Jours pour"]
[null,null,null,null,null,null,null,null,null,null,null,null,null,null,null,null,null,null,null,null,null,"Cout (min) du niv","Revenus (après)","Revenus (après)",null,"Temps","Heure","Jours","Débit","Manque","Crédit","externes","externe","Capital","Richesse","niv","rang"]
[null,null,null,null,null,null,null,null,null,null,null,null,null,null,null,null,null,null,null,null,1,null,2000,2000,null,null,0,{"$f":"AA311/24","v":0},null,null,{"$f":"$N$19","v":2000},null,null,null,{"$f":"$N$9","v":0}]
[null,null,null,null,null,null,null,null,null,null,null,null,null,null,null,null,null,null,null,null,null,null,null,null,null,null,null,null,null,null,null,null,null,null,null,1,{"$f":"IF(AI312<$N$7,($N$7-AI311)/(X311+$N$15/4)+AB311,\"N/A\")","v":80}]
[null,null,null,null,null,null,null,null,null,null,null,null,null,null,null,null,null,null,null,null,2,1600,4200,{"$f":"W313*($N$12+1)","v":4326},"P2",{"$f":"$DK$47/(1+$N$11)","v":3.4556574923547396},{"$f":"Z313+AA312","v":3.4556574923547396},{"$f":"AA313/24","v":0.14398572884811414},{"$f":"V313","v":1600},null,{"$f":"$N$6/24*(X311+X313)/2","v":93.19078120387708},{"$f":"$N$13/24*Z313","v":0},{"$f":"$N$15/24*Z313/4","v":0},{"$f":"AE311-AC313+AE313","v":493.19078120387707},{"$f":"AI311+AE313+AG313","v":93.19078120387708}]
[null,null,null,null,null,null,null,null,null,null,null,null,null,null,null,null,null,null,null,null,null,null,null,null,null,{"$f":"AE314/X313*24","v":23.893532420505537},{"$f":"Z314+AA313","v":27.349189912860275},1.1395495797025115,null,{"$f":"IF(V315-AH313>0,V315-AH313,0)","v":4306.8092187961229},{"$f":"AD314","v":4306.8092187961229},0,{"$f":"$N$15/24*Z314/4","v":0},{"$f":"AH313-AC314+AE314+AF313","v":4800},{"$f":"AI313+AE314+AG314","v":4400},2,{"$f":"IF(AI314<$N$7,($N$7-AI313)/(X313+$N$15/4)+AB313,\"N/A\")","v":37.108111761856925}]
[null,null,null,null,null,null,null,null,null,null,null,null,null,null,null,null,null,null,null,null,3,4800,6600,{"$f":"W315*($N$12+1)","v":6798},"P3",{"$f":"$DK$48/(1+$N$11)","v":3.4556574923547396},30.804847405215014,1.2835353085506256,{"$f":"V315","v":4800},null,{"$f":"$N$6/24*(X313+X315)/2","v":163.8719965399824},0,{"$f":"$N$15/24*Z315/4","v":0},163.8719965399824,{"$f":"AI314+AE315+AG315","v":4563.8719965399823}]
[null,null,null,null,null,null,null,null,null,null,null,null,null,null,null,null,null,null,null,null,null,null,null,null,null,{"$f":"AE316/X315*24","v":33.313779359082147},64.118626764297161,2.6716094485123816,null,{"$f":"IF(V317-AH315>0,V317-AH315,0)","v":9436.1280034600168},{"$f":"AD316","v":9436.1280034600168},0,0,9600,14000,3,{"$f":"IF(AI316<$N$7,($N$7-AI315)/(X315+$N$15/4)+AB315,\"N/A\")","v":24.148514420562982}]
[null,null,null,null,null,null,null,null,null,null,null,null,null,null,null,null,null,null,null,null,4,9600,9200,{"$f":"W317*($N$12+1)","v":9476},"P4",{"$f":"$DK$49/(1+$N$11)","v":4.9235474006116204},69.042174164908786,2.8767572568711994,{"$f":"V317","v":9600},null,{"$f":"$N$6/24*(X315+X317)/2","v":239.73866160478909},0,0,239.73866160478909,14239.73866160479]
[null,null,null,null,null,null,null,null,null,null,null,null,null,null,null,null,null,null,null,null,null,null,null,null,null,{"$f":"AE318/X317*24","v":39.916238087957481},108.95841225286627,4.5399338438694281,null,{"$f":"IF(V319-AH317>0,V319-AH317,0)","v":15760.26133839521},{"$f":"AD318","v":15760.26133839521},0,0,16000,30000,4,{"$f":"IF(AI318<$N$7,($N$7-AI317)/(X317+$N$15/4)+AB317,\"N/A\")","v":18.258802564848743}]
[null,null,null,null,null,null,null,null,null,null,null,null,null,null,null,null,null,null,null,null,5,16000,12000,{"$f":"W319*($N$12+1)","v":12360},"P5",{"$f":"$DK$50/(1+$N$11)","v":7.8593272171253812},116.81773946999165,4.8674058112496521,{"$f":"V319","v":16000},null,{"$f":"$N$6/24*(X317+X319)/2","v":321.67465987478028},0,0,321.67465987478028,30321.674659874781]
[null,null,null,null,null,null,null,null,null,null,null,null,null,null,null,null,null,null,null,null,null,null,null,null,null,{"$f":"AE320/X319*24","v":45.977330757524697},162.79507022751636,6.7831279261465154,null,{"$f":"IF(V321-AH319>0,V321-AH319,0)","v":23678.325340125219},{"$f":"AD320","v":23678.325340125219},0,0,24000,54000,5,{"$f":"IF(AI320<$N$7,($N$7-AI319)/(X319+$N$15/4)+AB319,\"N/A\")","v":15.35917970608179}]
[null,null,null,null,null,null,null,null,null,null,null,null,null,null,null,null,null,null,null,null,6,24000,15000,{"$f":"W321*($N$12+1)","v":15450},"P6",{"$f":"$DK$51/(1+$N$11)","v":12.262996941896024},175.0580671694124,7.2940861320588501,{"$f":"V321","v":24000},null,{"$f":"$N$6/24*(X319+X321)/2","v":409.67999134995603},0,0,409.67999134995603,54409.679991349956]
[null,null,null,null,null,null,null,null,null,null,null,null,null,null,null,null,null,null,null,null,null,null,null,null,null,{"$f":"AE322/X321*24","v":15.518943702757348},190.57701087216975,7.940708786340406,null,{"$f":"IF(V323-AH321>0,V323-AH321,0)","v":9990.3200086500437},{"$f":"AD322","v":9990.3200086500437},0,0,10400,64400,6,{"$f":"IF(AI322<$N$7,($N$7-AI321)/(X321+$N$15/4)+AB321,\"N/A\")","v":14.128411051712575}]
[null,null,null,null,null,null,null,null,null,null,null,null,null,null,null,null,null,null,null,null,7,10400,17500,{"$f":"W323*($N$12+1)","v":18025},"A7",{"$f":"$DK$52/(1+$N$11)","v":18.134556574923547},208.7115674470933,8.6963153102955548,{"$f":"V323","v":10400},null,{"$f":"Z323/24*X321","v":11674.120795107034},0,0,11674.120795107034,76074.120795107039]
[null,null,null,null,null,null,null,null,null,null,null,null,null,null,null,null,null,null,null,null,null,null,null,null,null,{"$f":"AE324/X323*24","v":6.8250264031861958},215.5365938502795,8.980691410428312,null,{"$f":"IF(V325-AH323>0,V325-AH323,0)","v":5125.8792048929663},{"$f":"AD324","v":5125.8792048929663},0,0,16800,81200,7,{"$f":"IF(AI324<$N$7,($N$7-AI323)/(X323+$N$15/4)+AB323,\"N/A\")","v":13.352397374367285}]
[null,null,null,null,null,null,null,null,null,null,null,null,null,null,null,null,null,null,null,null,8,16800,20000,{"$f":"W325*($N$12+1)","v":20600},"A8",{"$f":"$DK$53/(1+$N$11)","v":25.474006116207953},241.01059996648746,10.042108331936978,{"$f":"V325","v":16800},null,{"$f":"Z325/24*X323","v":19132.040010193679},0,0,19132.040010193679,100332.04001019368]
[null,null,null,null,null,null,null,null,null,null,null,null,null,null,null,null,null,null,null,null,null,null,null,null,null,{"$f":"AE326/X325*24","v":9.3995650366675587},250.41016500315502,10.43375687513146,null,{"$f":"IF(V327-AH325>0,V327-AH325,0)","v":8067.9599898063207},{"$f":"AD326","v":8067.9599898063207},0,0,27200,108400,8,{"$f":"IF(AI326<$N$7,($N$7-AI325)/(X325+$N$15/4)+AB325,\"N/A\")","v":12.938611244063498}]
[null,null,null,null,null,null,null,null,null,null,null,null,null,null,null,null,null,null,null,null,9,27200,22500,{"$f":"W327*($N$12+1)","v":23175},"A9",{"$f":"$DK$54/(1+$N$11)","v":34.281345565749227},284.69151056890422,11.862146273704342,{"$f":"V327","v":27200},null,{"$f":"Z327/24*X325","v":29424.821610601419},0,0,29424.821610601419,137824.82161060142]
[null,null,null,null,null,null,null,null,null,null,null,null,null,null,null,null,null,null,null,null,null,null,null,null,null,{"$f":"AE328/X327*24","v":15.094035872516331},299.78554644142054,12.491064435059188,null,{"$f":"IF(V329-AH327>0,V329-AH327,0)","v":14575.178389398581},{"$f":"AD328","v":14575.178389398581},0,0,44000,152400,9,{"$f":"IF(AI328<$N$7,($N$7-AI327)/(X327+$N$15/4)+AB327,\"N/A\")","v":12.819004025134701}]
[null,null,null,null,null,null,null,null,null,null,null,null,null,null,null,null,null,null,null,null,10,44000,25000,{"$f":"W329*($N$12+1)","v":25750},"A10",{"$f":"$DK$55/(1+$N$11)","v":44.556574923547394},344.34212136496791,14.347588390206996,{"$f":"V329","v":44000},null,{"$f":"Z329/24*X327","v":43024.942660550456},0,0,43024.942660550456,195424.94266055047]
[null,null,null,null,null,null,null,null,null,null,null,null,null,null,null,null,null,null,null,null,null,null,null,null,null,null,null,null,null,null,null,null,null,null,195424.94266055047,10,{"$f":"IF(AI330<$N$7,($N$7-AI329)/(X329+$N$15/4)+AB329,\"N/A\")","v":"N/A"}]
[]
[null,null,null,null,null,null,null,null,null,null,null,null,null,null,null,null,null,null,null,null,null,null,null,null,null,null,null,null,null,null,null,null,null,null,null,"min",{"$f":"MIN(AK312:AK330)","v":12.819004025134701}]
[null,null,null,null,null,null,null,null,null,null,null,null,null,null,null,null,null,null,null,null,null,"Ligne 7"]
[null,null,null,null,null,null,null,null,null,null,null,null,null,null,null,null,null,null,null,null,null,"PERF 30%"]
[null,null,null,null,null,null,null,null,null,null,null,null,null,null,null,null,null,null,null,null,null,null,null,null,null,null,"Cumul","Cumul",null,null,null,"Revenus","Rich.",null,null,null,"Jours pour"]
[null,null,null,null,null,null,null,null,null,null,null,null,null,null,null,null,null,null,null,null,null,"Cout (min) du niv","Revenus (après)","Revenus (après)",null,"Temps","Heure","Jours","Débit","Manque","Crédit","externes","externe","Capital","Richesse","niv","rang"]
[null,null,null,null,null,null,null,null,null,null,null,null,null,null,null,null,null,null,null,null,1,null,2000,2000,null,null,0,{"$f":"AA337/24","v":0},null,null,{"$f":"$N$19","v":2000},null,null,null,{"$f":"$N$9","v":0}]
[null,null,null,null,null,null,null,null,null,null,null,null,null,null,null,null,null,null,null,null,null,null,null,null,null,null,null,null,null,null,null,null,null,null,null,1,{"$f":"IF(AI338<$N$7,($N$7-AI337)/(X337+$N$15/4)+AB337,\"N/A\")","v":80}]
[null,null,null,null,null,null,null,null,null,null,null,null,null,null,null,null,null,null,null,null,2,1600,4200,{"$f":"W339*($N$12+1)","v":4326},"P2",{"$f":"$DK$47/(1+$N$11)","v":3.4556574923547396},{"$f":"Z339+AA338","v":3.4556574923547396},{"$f":"AA339/24","v":0.14398572884811414},{"$f":"V339","v":1600},null,{"$f":"$N$6/24*(X337+X339)/2","v":93.19078120387708},{"$f":"$N$13/24*Z339","v":0},{"$f":"$N$15/24*Z339/4","v":0},{"$f":"AE337-AC339+AE339","v":493.19078120387707},{"$f":"AI337+AE339+AG339","v":93.19078120387708}]
[null,null,null,null,null,null,null,null,null,null,null,null,null,null,null,null,null,null,null,null,null,null,null,null,null,{"$f":"AE340/X339*24","v":23.893532420505537},{"$f":"Z340+AA339","v":27.349189912860275},1.1395495797025115,null,{"$f":"IF(V341-AH339>0,V341-AH339,0)","v":4306.8092187961229},{"$f":"AD340","v":4306.8092187961229},0,{"$f":"$N$15/24*Z340/4","v":0},{"$f":"AH339-AC340+AE340+AF339","v":4800},{"$f":"AI339+AE340+AG340","v":4400},2,{"$f":"IF(AI340<$N$7,($N$7-AI339)/(X339+$N$15/4)+AB339,\"N/A\")","v":37.108111761856925}]
[null,null,null,null,null,null,null,null,null,null,null,null,null,null,null,null,null,null,null,null,3,4800,6600,{"$f":"W341*($N$12+1)","v":6798},"P3",{"$f":"$DK$48/(1+$N$11)","v":3.4556574923547396},30.804847405215014,1.2835353085506256,{"$f":"V341","v":4800},null,{"$f":"$N$6/24*(X339+X341)/2","v":163.8719965399824},0,{"$f":"$N$15/24*Z341/4","v":0},163.8719965399824,{"$f":"AI340+AE341+AG341","v":4563.8719965399823}]
[null,null,null,null,null,null,null,null,null,null,null,null,null,null,null,null,null,null,null,null,null,null,null,null,null,{"$f":"AE342/X341*24","v":33.313779359082147},64.118626764297161,2.6716094485123816,null,{"$f":"IF(V343-AH341>0,V343-AH341,0)","v":9436.1280034600168},{"$f":"AD342","v":9436.1280034600168},0,0,9600,14000,3,{"$f":"IF(AI342<$N$7,($N$7-AI341)/(X341+$N$15/4)+AB341,\"N/A\")","v":24.148514420562982}]
[null,null,null,null,null,null,null,null,null,null,null,null,null,null,null,null,null,null,null,null,4,9600,9200,{"$f":"W343*($N$12+1)","v":9476},"P4",{"$f":"$DK$49/(1+$N$11)","v":4.9235474006116204},69.042174164908786,2.8767572568711994,{"$f":"V343","v":9600},null,{"$f":"$N$6/24*(X341+X343)/2","v":239.73866160478909},0,0,239.73866160478909,14239.73866160479]
[null,null,null,null,null,null,null,null,null,null,null,null,null,null,null,null,null,null,null,null,null,null,null,null,null,{"$f":"AE344/X343*24","v":39.916238087957481},108.95841225286627,4.5399338438694281,null,{"$f":"IF(V345-AH343>0,V345-AH343,0)","v":15760.26133839521},{"$f":"AD344","v":15760.26133839521},0,0,16000,30000,4,{"$f":"IF(AI344<$N$7,($N$7-AI343)/(X343+$N$15/4)+AB343,\"N/A\")","v":18.258802564848743}]
[null,null,null,null,null,null,null,null,null,null,null,null,null,null,null,null,null,null,null,null,5,16000,12000,{"$f":"W345*($N$12+1)","v":12360},"P5",{"$f":"$DK$50/(1+$N$11)","v":7.8593272171253812},116.81773946999165,4.8674058112496521,{"$f":"V345","v":16000},null,{"$f":"$N$6/24*(X343+X345)/2","v":321.67465987478028},0,0,321.67465987478028,30321.674659874781]
[null,null,null,null,null,null,null,null,null,null,null,null,null,null,null,null,null,null,null,null,null,null,null,null,null,{"$f":"AE346/X345*24","v":45.977330757524697},162.79507022751636,6.7831279261465154,null,{"$f":"IF(V347-AH345>0,V347-AH345,0)","v":23678.325340125219},{"$f":"AD346","v":23678.325340125219},0,0,24000,54000,5,{"$f":"IF(AI346<$N$7,($N$7-AI345)/(X345+$N$15/4)+AB345,\"N/A\")","v":15.35917970608179}]
[null,null,null,null,null,null,null,null,null,null,null,null,null,null,null,null,null,null,null,null,6,24000,15000,{"$f":"W347*($N$12+1)","v":15450},"P6",{"$f":"$DK$51/(1+$N$11)","v":12.262996941896024},175.0580671694124,7.2940861320588501,{"$f":"V347","v":24000},null,{"$f":"$N$6/24*(X345+X347)/2","v":409.67999134995603},0,0,409.67999134995603,54409.679991349956]
[null,null,null,null,null,null,null,null,null,null,null,null,null,null,null,null,null,null,null,null,null,null,null,null,null,{"$f":"AE348/X347*24","v":51.557778654213664},226.61584582362605,9.4423269093177513,null,{"$f":"IF(V349-AH347>0,V349-AH347,0)","v":33190.320008650044},{"$f":"AD348","v":33190.320008650044},0,0,33600,87600,6,{"$f":"IF(AI348<$N$7,($N$7-AI347)/(X347+$N$15/4)+AB347,\"N/A\")","v":14.128411051712575}]
[null,null,null,null,null,null,null,null,null,null,null,null,null,null,null,null,null,null,null,null,7,33600,18200,{"$f":"W349*($N$12+1)","v":18746},"P7",{"$f":"$DK$52/(1+$N$11)","v":18.134556574923547},244.7504023985496,9.0474353257068945,33600,null,489.08219032069542,0,0,489.08219032069542,88089.082190320696]
[null,null,null,null,null,null,null,null,null,null,null,null,null,null,null,null,null,null,null,null,null,null,null,null,null,{"$f":"AE350/X349*24","v":56.730077212861588},301.48047961141117,11.482101139425538,null,{"$f":"IF(V351-AH349>0,V351-AH349,0)","v":16310.917809679304},44310.917809679304,0,0,44800,132400,7,{"$f":"IF(AI350<$N$7,($N$7-AI349)/(X349+$N$15/4)+AB349,\"N/A\")","v":12.883502636582778}]
[null,null,null,null,null,null,null,null,null,null,null,null,null,null,null,null,null,null,null,null,8,16800,20800,{"$f":"W351*($N$12+1)","v":21424},"A8",{"$f":"$DK$53/(1+$N$11)","v":25.474006116207953},326.9544857276191,13.62310357198413,{"$f":"V351","v":16800},null,{"$f":"Z351/24*X349","v":19897.321610601426},0,0,47897.32161060143,152297.32161060142]
[null,null,null,null,null,null,null,null,null,null,null,null,null,null,null,null,null,null,null,null,null,null,null,null,null,{"$f":"AE352/X351*24","v":0},326.9544857276191,13.62310357198413,null,{"$f":"IF(V353-AH351>0,V353-AH351,0)","v":0},{"$f":"AD352","v":0},0,0,47897.32161060143,152297.32161060142,8,{"$f":"IF(AI352<$N$7,($N$7-AI351)/(X351+$N$15/4)+AB351,\"N/A\")","v":13.982638597628201}]
[null,null,null,null,null,null,null,null,null,null,null,null,null,null,null,null,null,null,null,null,9,27200,23400,{"$f":"W353*($N$12+1)","v":24102},"A9",{"$f":"$DK$54/(1+$N$11)","v":34.281345565749227},361.23583129336834,15.051492970557014,{"$f":"V353","v":27200},null,{"$f":"Z353/24*X351","v":30601.814475025476},0,0,51299.136085626902,182899.1360856269]
[null,null,null,null,null,null,null,null,null,null,null,null,null,null,null,null,null,null,null,null,null,null,null,null,null,{"$f":"AE354/X353*24","v":0},361.23583129336834,15.051492970557014,null,{"$f":"IF(V355-AH353>0,V355-AH353,0)","v":0},{"$f":"AD354","v":0},0,0,51299.136085626902,182899.1360856269,9,{"$f":"IF(AI354<$N$7,($N$7-AI353)/(X353+$N$15/4)+AB353,\"N/A\")","v":"N/A"}]
[null,null,null,null,null,null,null,null,null,null,null,null,null,null,null,null,null,null,null,null,10,44000,26000,{"$f":"W355*($N$12+1)","v":26780},"A10",{"$f":"$DK$55/(1+$N$11)","v":44.556574923547394},405.79240621691571,16.908016925704821,{"$f":"V355","v":44000},null,{"$f":"Z355/24*X353","v":44745.940366972471},0,0,52045.076452599373,227645.07645259937]
[null,null,null,null,null,null,null,null,null,null,null,null,null,null,null,null,null,null,null,null,null,null,null,null,null,null,null,null,null,null,null,null,null,null,227645.07645259937,10,{"$f":"IF(AI356<$N$7,($N$7-AI355)/(X355+$N$15/4)+AB355,\"N/A\")","v":"N/A"}]
[]
[null,null,null,null,null,null,null,null,null,null,null,null,null,null,null,null,null,null,null,null,null,null,null,null,null,null,null,null,null,null,null,null,null,null,null,"min",{"$f":"MIN(AK338:AK356)","v":12.883502636582778}]
[]
[]
[null,null,null,null,null,null,null,null,null,null,null,null,null,null,null,null,null,null,null,null,null,"Ligne 8"]
[null,null,null,null,null,null,null,null,null,null,null,null,null,null,null,null,null,null,null,null,null,"PERF 35%"]
[null,null,null,null,null,null,null,null,null,null,null,null,null,null,null,null,null,null,null,null,null,null,null,null,null,null,"Cumul","Cumul",null,null,null,"Revenus","Rich.",null,null,null,"Jours pour"]
[null,null,null,null,null,null,null,null,null,null,null,null,null,null,null,null,null,null,null,null,null,"Cout (min) du niv","Revenus (après)","Revenus (après)",null,"Temps","Heure","Jours","Débit","Manque","Crédit","externes","externe","Capital","Richesse","niv","rang"]
[null,null,null,null,null,null,null,null,null,null,null,null,null,null,null,null,null,null,null,null,1,null,2000,2000,null,null,0,{"$f":"AA365/24","v":0},null,null,{"$f":"$N$19","v":2000},null,null,null,{"$f":"$N$9","v":0}]
[null,null,null,null,null,null,null,null,null,null,null,null,null,null,null,null,null,null,null,null,null,null,null,null,null,null,null,null,null,null,null,null,null,null,null,1,{"$f":"IF(AI366<$N$7,($N$7-AI365)/(X365+$N$15/4)+AB365,\"N/A\")","v":80}]
[null,null,null,null,null,null,null,null,null,null,null,null,null,null,null,null,null,null,null,null,2,1600,4200,{"$f":"W367*($N$12+1)","v":4326},"P2",{"$f":"$DK$47/(1+$N$11)","v":3.4556574923547396},{"$f":"Z367+AA366","v":3.4556574923547396},{"$f":"AA367/24","v":0.14398572884811414},{"$f":"V367","v":1600},null,{"$f":"$N$6/24*(X365+X367)/2","v":93.19078120387708},{"$f":"$N$13/24*Z367","v":0},{"$f":"$N$15/24*Z367/4","v":0},{"$f":"AE365-AC367+AE367","v":493.19078120387707},{"$f":"AI365+AE367+AG367","v":93.19078120387708}]
[null,null,null,null,null,null,null,null,null,null,null,null,null,null,null,null,null,null,null,null,null,null,null,null,null,{"$f":"AE368/X367*24","v":23.893532420505537},{"$f":"Z368+AA367","v":27.349189912860275},1.1395495797025115,null,{"$f":"IF(V369-AH367>0,V369-AH367,0)","v":4306.8092187961229},{"$f":"AD368","v":4306.8092187961229},0,{"$f":"$N$15/24*Z368/4","v":0},{"$f":"AH367-AC368+AE368+AF367","v":4800},{"$f":"AI367+AE368+AG368","v":4400},2,{"$f":"IF(AI368<$N$7,($N$7-AI367)/(X367+$N$15/4)+AB367,\"N/A\")","v":37.108111761856925}]
[null,null,null,null,null,null,null,null,null,null,null,null,null,null,null,null,null,null,null,null,3,4800,6600,{"$f":"W369*($N$12+1)","v":6798},"P3",{"$f":"$DK$48/(1+$N$11)","v":3.4556574923547396},30.804847405215014,1.2835353085506256,{"$f":"V369","v":4800},null,{"$f":"$N$6/24*(X367+X369)/2","v":163.8719965399824},0,{"$f":"$N$15/24*Z369/4","v":0},163.8719965399824,{"$f":"AI368+AE369+AG369","v":4563.8719965399823}]
[null,null,null,null,null,null,null,null,null,null,null,null,null,null,null,null,null,null,null,null,null,null,null,null,null,{"$f":"AE370/X369*24","v":33.313779359082147},64.118626764297161,2.6716094485123816,null,{"$f":"IF(V371-AH369>0,V371-AH369,0)","v":9436.1280034600168},{"$f":"AD370","v":9436.1280034600168},0,0,9600,14000,3,{"$f":"IF(AI370<$N$7,($N$7-AI369)/(X369+$N$15/4)+AB369,\"N/A\")","v":24.148514420562982}]
[null,null,null,null,null,null,null,null,null,null,null,null,null,null,null,null,null,null,null,null,4,9600,9200,{"$f":"W371*($N$12+1)","v":9476},"P4",{"$f":"$DK$49/(1+$N$11)","v":4.9235474006116204},69.042174164908786,2.8767572568711994,{"$f":"V371","v":9600},null,{"$f":"$N$6/24*(X369+X371)/2","v":239.73866160478909},0,0,239.73866160478909,14239.73866160479]
[null,null,null,null,null,null,null,null,null,null,null,null,null,null,null,null,null,null,null,null,null,null,null,null,null,{"$f":"AE372/X371*24","v":39.916238087957481},108.95841225286627,4.5399338438694281,null,{"$f":"IF(V373-AH371>0,V373-AH371,0)","v":15760.26133839521},{"$f":"AD372","v":15760.26133839521},0,0,16000,30000,4,{"$f":"IF(AI372<$N$7,($N$7-AI371)/(X371+$N$15/4)+AB371,\"N/A\")","v":18.258802564848743}]
[null,null,null,null,null,null,null,null,null,null,null,null,null,null,null,null,null,null,null,null,5,16000,12000,{"$f":"W373*($N$12+1)","v":12360},"P5",{"$f":"$DK$50/(1+$N$11)","v":7.8593272171253812},116.81773946999165,4.8674058112496521,{"$f":"V373","v":16000},null,{"$f":"$N$6/24*(X371+X373)/2","v":321.67465987478028},0,0,321.67465987478028,30321.674659874781]
[null,null,null,null,null,null,null,null,null,null,null,null,null,null,null,null,null,null,null,null,null,null,null,null,null,{"$f":"AE374/X373*24","v":45.977330757524697},162.79507022751636,6.7831279261465154,null,{"$f":"IF(V375-AH373>0,V375-AH373,0)","v":23678.325340125219},{"$f":"AD374","v":23678.325340125219},0,0,24000,54000,5,{"$f":"IF(AI374<$N$7,($N$7-AI373)/(X373+$N$15/4)+AB373,\"N/A\")","v":15.35917970608179}]
[null,null,null,null,null,null,null,null,null,null,null,null,null,null,null,null,null,null,null,null,6,24000,15000,{"$f":"W375*($N$12+1)","v":15450},"P6",{"$f":"$DK$51/(1+$N$11)","v":12.262996941896024},175.0580671694124,7.2940861320588501,{"$f":"V375","v":24000},null,{"$f":"$N$6/24*(X373+X375)/2","v":409.67999134995603},0,0,409.67999134995603,54409.679991349956]
[null,null,null,null,null,null,null,null,null,null,null,null,null,null,null,null,null,null,null,null,null,null,null,null,null,{"$f":"AE376/X375*24","v":51.557778654213664},226.61584582362605,9.4423269093177513,null,{"$f":"IF(V377-AH375>0,V377-AH375,0)","v":33190.320008650044},{"$f":"AD376","v":33190.320008650044},0,0,33600,87600,6,{"$f":"IF(AI376<$N$7,($N$7-AI375)/(X375+$N$15/4)+AB375,\"N/A\")","v":14.128411051712575}]
[null,null,null,null,null,null,null,null,null,null,null,null,null,null,null,null,null,null,null,null,7,33600,18200,{"$f":"W377*($N$12+1)","v":18746},"P7",{"$f":"$DK$52/(1+$N$11)","v":18.134556574923547},244.7504023985496,9.0474353257068945,33600,null,489.08219032069542,0,0,489.08219032069542,88089.082190320696]
[null,null,null,null,null,null,null,null,null,null,null,null,null,null,null,null,null,null,null,null,null,null,null,null,null,{"$f":"AE378/X377*24","v":56.730077212861588},301.48047961141117,11.482101139425538,null,{"$f":"IF(V379-AH377>0,V379-AH377,0)","v":44310.917809679304},44310.917809679304,0,0,44800,132400,7,{"$f":"IF(AI378<$N$7,($N$7-AI377)/(X377+$N$15/4)+AB377,\"N/A\")","v":12.883502636582778}]
[null,null,null,null,null,null,null,null,null,null,null,null,null,null,null,null,null,null,null,null,8,44800,21600,{"$f":"W379*($N$12+1)","v":22248},"P8",{"$f":"$DK$53/(1+$N$11)","v":25.474006116207953},326.9544857276191,{"$f":"AA379/24","v":13.62310357198413},{"$f":"V379","v":44800},null,{"$f":"$N$6/24*(X377+X379)/2","v":603.89865391586113},0,0,603.89865391586113,133003.89865391585]
[null,null,null,null,null,null,null,null,null,null,null,null,null,null,null,null,null,null,null,null,null,null,null,null,null,{"$f":"AE380/X379*24","v":28.690508463952682},355.64499419157175,{"$f":"AA380/24","v":14.818541424648823},null,{"$f":"IF(V381-AH379>0,V381-AH379,0)","v":26596.101346084139},{"$f":"AD380","v":26596.101346084139},0,0,27200,159600,8,{"$f":"IF(AI380<$N$7,($N$7-AI379)/(X379+$N$15/4)+AB379,\"N/A\")","v":14.836520568841562}]
[null,null,null,null,null,null,null,null,null,null,null,null,null,null,null,null,null,null,null,null,9,27200,24300,{"$f":"W381*($N$12+1)","v":25029},"A9",{"$f":"$DK$54/(1+$N$11)","v":34.281345565749227},389.92633975732099,16.246930823221707,{"$f":"V381","v":27200},null,{"$f":"Z381/24*X379","v":31778.807339449533},0,0,31778.807339449533,191378.80733944953]
[null,null,null,null,null,null,null,null,null,null,null,null,null,null,null,null,null,null,null,null,null,null,null,null,null,{"$f":"AE382/X381*24","v":11.718751202733277},401.64509096005429,16.735212123335597,null,{"$f":"IF(V383-AH381>0,V383-AH381,0)","v":12221.192660550467},{"$f":"AD382","v":12221.192660550467},0,0,44000,203600,9,{"$f":"IF(AI382<$N$7,($N$7-AI381)/(X381+$N$15/4)+AB381,\"N/A\")","v":"N/A"}]
[null,null,null,null,null,null,null,null,null,null,null,null,null,null,null,null,null,null,null,null,10,44000,27000,{"$f":"W383*($N$12+1)","v":27810},"A10",{"$f":"$DK$55/(1+$N$11)","v":44.556574923547394},446.20166588360166,18.591736078483404,{"$f":"V383","v":44000},null,{"$f":"Z383/24*X381","v":46466.938073394485},0,0,46466.938073394485,250066.93807339447]
[null,null,null,null,null,null,null,null,null,null,null,null,null,null,null,null,null,null,null,null,null,null,null,null,null,null,null,null,null,null,null,null,null,null,250066.93807339447,10,{"$f":"IF(AI384<$N$7,($N$7-AI383)/(X383+$N$15/4)+AB383,\"N/A\")","v":"N/A"}]
[]
[null,null,null,null,null,null,null,null,null,null,null,null,null,null,null,null,null,null,null,null,null,null,null,null,null,null,null,null,null,null,null,null,null,null,null,"min",{"$f":"MIN(AK366:AK384)","v":12.883502636582778}]
[]
[null,null,null,null,null,null,null,null,null,null,null,null,null,null,null,null,null,null,null,null,null,"Ligne 8"]
[null,null,null,null,null,null,null,null,null,null,null,null,null,null,null,null,null,null,null,null,null,"PERF 40%"]
[null,null,null,null,null,null,null,null,null,null,null,null,null,null,null,null,null,null,null,null,null,null,null,null,null,null,"Cumul","Cumul",null,null,null,"Revenus","Rich.",null,null,null,"Jours pour"]
[null,null,null,null,null,null,null,null,null,null,null,null,null,null,null,null,null,null,null,null,null,"Cout (min) du niv","Revenus (après)","Revenus (après)",null,"Temps","Heure","Jours","Débit","Manque","Crédit","externes","externe","Capital","Richesse","niv","rang"]
[null,null,null,null,null,null,null,null,null,null,null,null,null,null,null,null,null,null,null,null,1,null,2000,2000,null,null,0,{"$f":"AA392/24","v":0},null,null,{"$f":"$N$19","v":2000},null,null,null,{"$f":"$N$9","v":0}]
[null,null,null,null,null,null,null,null,null,null,null,null,null,null,null,null,null,null,null,null,null,null,null,null,null,null,null,null,null,null,null,null,null,null,null,1,{"$f":"IF(AI393<$N$7,($N$7-AI392)/(X392+$N$15/4)+AB392,\"N/A\")","v":80}]
[null,null,null,null,null,null,null,null,null,null,null,null,null,null,null,null,null,null,null,null,2,1600,4200,{"$f":"W394*($N$12+1)","v":4326},"P2",{"$f":"$DK$47/(1+$N$11)","v":3.4556574923547396},{"$f":"Z394+AA393","v":3.4556574923547396},{"$f":"AA394/24","v":0.14398572884811414},{"$f":"V394","v":1600},null,{"$f":"$N$6/24*(X392+X394)/2","v":93.19078120387708},{"$f":"$N$13/24*Z394","v":0},{"$f":"$N$15/24*Z394/4","v":0},{"$f":"AE392-AC394+AE394","v":493.19078120387707},{"$f":"AI392+AE394+AG394","v":93.19078120387708}]
[null,null,null,null,null,null,null,null,null,null,null,null,null,null,null,null,null,null,null,null,null,null,null,null,null,{"$f":"AE395/X394*24","v":23.893532420505537},{"$f":"Z395+AA394","v":27.349189912860275},1.1395495797025115,null,{"$f":"IF(V396-AH394>0,V396-AH394,0)","v":4306.8092187961229},{"$f":"AD395","v":4306.8092187961229},0,{"$f":"$N$15/24*Z395/4","v":0},{"$f":"AH394-AC395+AE395+AF394","v":4800},{"$f":"AI394+AE395+AG395","v":4400},2,{"$f":"IF(AI395<$N$7,($N$7-AI394)/(X394+$N$15/4)+AB394,\"N/A\")","v":37.108111761856925}]
[null,null,null,null,null,null,null,null,null,null,null,null,null,null,null,null,null,null,null,null,3,4800,6600,{"$f":"W396*($N$12+1)","v":6798},"P3",{"$f":"$DK$48/(1+$N$11)","v":3.4556574923547396},30.804847405215014,1.2835353085506256,{"$f":"V396","v":4800},null,{"$f":"$N$6/24*(X394+X396)/2","v":163.8719965399824},0,{"$f":"$N$15/24*Z396/4","v":0},163.8719965399824,{"$f":"AI395+AE396+AG396","v":4563.8719965399823}]
[null,null,null,null,null,null,null,null,null,null,null,null,null,null,null,null,null,null,null,null,null,null,null,null,null,{"$f":"AE397/X396*24","v":33.313779359082147},64.118626764297161,2.6716094485123816,null,{"$f":"IF(V398-AH396>0,V398-AH396,0)","v":9436.1280034600168},{"$f":"AD397","v":9436.1280034600168},0,0,9600,14000,3,{"$f":"IF(AI397<$N$7,($N$7-AI396)/(X396+$N$15/4)+AB396,\"N/A\")","v":24.148514420562982}]
[null,null,null,null,null,null,null,null,null,null,null,null,null,null,null,null,null,null,null,null,4,9600,9200,{"$f":"W398*($N$12+1)","v":9476},"P4",{"$f":"$DK$49/(1+$N$11)","v":4.9235474006116204},69.042174164908786,2.8767572568711994,{"$f":"V398","v":9600},null,{"$f":"$N$6/24*(X396+X398)/2","v":239.73866160478909},0,0,239.73866160478909,14239.73866160479]
[null,null,null,null,null,null,null,null,null,null,null,null,null,null,null,null,null,null,null,null,null,null,null,null,null,{"$f":"AE399/X398*24","v":39.916238087957481},108.95841225286627,4.5399338438694281,null,{"$f":"IF(V400-AH398>0,V400-AH398,0)","v":15760.26133839521},{"$f":"AD399","v":15760.26133839521},0,0,16000,30000,4,{"$f":"IF(AI399<$N$7,($N$7-AI398)/(X398+$N$15/4)+AB398,\"N/A\")","v":18.258802564848743}]
[null,null,null,null,null,null,null,null,null,null,null,null,null,null,null,null,null,null,null,null,5,16000,12000,{"$f":"W400*($N$12+1)","v":12360},"P5",{"$f":"$DK$50/(1+$N$11)","v":7.8593272171253812},116.81773946999165,4.8674058112496521,{"$f":"V400","v":16000},null,{"$f":"$N$6/24*(X398+X400)/2","v":321.67465987478028},0,0,321.67465987478028,30321.674659874781]
[null,null,null,null,null,null,null,null,null,null,null,null,null,null,null,null,null,null,null,null,null,null,null,null,null,{"$f":"AE401/X400*24","v":45.977330757524697},162.79507022751636,6.7831279261465154,null,{"$f":"IF(V402-AH400>0,V402-AH400,0)","v":23678.325340125219},{"$f":"AD401","v":23678.325340125219},0,0,24000,54000,5,{"$f":"IF(AI401<$N$7,($N$7-AI400)/(X400+$N$15/4)+AB400,\"N/A\")","v":15.35917970608179}]
[null,null,null,null,null,null,null,null,null,null,null,null,null,null,null,null,null,null,null,null,6,24000,15000,{"$f":"W402*($N$12+1)","v":15450},"P6",{"$f":"$DK$51/(1+$N$11)","v":12.262996941896024},175.0580671694124,7.2940861320588501,{"$f":"V402","v":24000},null,{"$f":"$N$6/24*(X400+X402)/2","v":409.67999134995603},0,0,409.67999134995603,54409.679991349956]
[null,null,null,null,null,null,null,null,null,null,null,null,null,null,null,null,null,null,null,null,null,null,null,null,null,{"$f":"AE403/X402*24","v":51.557778654213664},226.61584582362605,9.4423269093177513,null,{"$f":"IF(V404-AH402>0,V404-AH402,0)","v":33190.320008650044},{"$f":"AD403","v":33190.320008650044},0,0,33600,87600,6,{"$f":"IF(AI403<$N$7,($N$7-AI402)/(X402+$N$15/4)+AB402,\"N/A\")","v":14.128411051712575}]
[null,null,null,null,null,null,null,null,null,null,null,null,null,null,null,null,null,null,null,null,7,33600,18200,{"$f":"W404*($N$12+1)","v":18746},"P7",{"$f":"$DK$52/(1+$N$11)","v":18.134556574923547},244.7504023985496,9.0474353257068945,33600,null,489.08219032069542,0,0,489.08219032069542,88089.082190320696]
[null,null,null,null,null,null,null,null,null,null,null,null,null,null,null,null,null,null,null,null,null,null,null,null,null,{"$f":"AE405/X404*24","v":56.730077212861588},301.48047961141117,11.482101139425538,null,{"$f":"IF(V406-AH404>0,V406-AH404,0)","v":44310.917809679304},44310.917809679304,0,0,44800,132400,7,{"$f":"IF(AI405<$N$7,($N$7-AI404)/(X404+$N$15/4)+AB404,\"N/A\")","v":12.883502636582778}]
[null,null,null,null,null,null,null,null,null,null,null,null,null,null,null,null,null,null,null,null,8,44800,21600,{"$f":"W406*($N$12+1)","v":22248},"P8",{"$f":"$DK$53/(1+$N$11)","v":25.474006116207953},326.9544857276191,{"$f":"AA406/24","v":13.62310357198413},{"$f":"V406","v":44800},null,{"$f":"$N$6/24*(X404+X406)/2","v":603.89865391586113},0,0,603.89865391586113,133003.89865391585]
[null,null,null,null,null,null,null,null,null,null,null,null,null,null,null,null,null,null,null,null,null,null,null,null,null,{"$f":"AE407/X406*24","v":61.484467471503933},388.43895319912303,{"$f":"AA407/24","v":16.184956383296793},null,{"$f":"IF(V408-AH406>0,V408-AH406,0)","v":56996.101346084142},{"$f":"AD407","v":56996.101346084142},0,0,57600,190000,8,{"$f":"IF(AI407<$N$7,($N$7-AI406)/(X406+$N$15/4)+AB406,\"N/A\")","v":"N/A"}]
[null,null,null,null,null,null,null,null,null,null,null,null,null,null,null,null,null,null,null,null,9,57600,25200,{"$f":"W408*($N$12+1)","v":25956},"P9",{"$f":"$DK$54/(1+$N$11)","v":34.281345565749227},422.72029876487227,{"$f":"AA408/24","v":17.613345781869679},{"$f":"V408","v":57600},null,{"$f":"$N$6/24*(X406+X408)/2","v":710.11198500659043},0,0,710.11198500659043,190710.1119850066]
[null,null,null,null,null,null,null,null,null,null,null,null,null,null,null,null,null,null,null,null,null,null,null,null,null,{"$f":"AE409/X408*24","v":40.027635705033205},462.74793446990549,{"$f":"AA409/24","v":19.281163936246063},null,{"$f":"IF(V410-AH408>0,V410-AH408,0)","v":43289.888014993412},{"$f":"AD409","v":43289.888014993412},0,0,44000,234000,9,{"$f":"IF(AI409<$N$7,($N$7-AI408)/(X408+$N$15/4)+AB408,\"N/A\")","v":"N/A"}]
[null,null,null,null,null,null,null,null,null,null,null,null,null,null,null,null,null,null,null,null,10,44000,28000,{"$f":"W410*($N$12+1)","v":28840},"A10",{"$f":"$DK$55/(1+$N$11)","v":44.556574923547394},507.30450939345286,21.13768789139387,{"$f":"V410","v":44000},null,{"$f":"Z410/24*X408","v":48187.935779816507},0,0,48187.935779816507,282187.93577981653]
[null,null,null,null,null,null,null,null,null,null,null,null,null,null,null,null,null,null,null,null,null,null,null,null,null,null,null,null,null,null,null,null,null,null,282187.93577981653,10,{"$f":"IF(AI411<$N$7,($N$7-AI410)/(X410+$N$15/4)+AB410,\"N/A\")","v":"N/A"}]
[]
[null,null,null,null,null,null,null,null,null,null,null,null,null,null,null,null,null,null,null,null,null,null,null,null,null,null,null,null,null,null,null,null,null,null,null,"min",{"$f":"MIN(AK393:AK411)","v":12.883502636582778}]

{"sheet":"Domination","index":2,"n_rows":38,"n_cols":44,"rows_kept":38,"cut":false,"hidden":false,"merged":[]}
[]
[null,null,null,null,null,null,null,null,null,null,null,null,null,null,null,null,null,null,null,null,null,null,null,null,null,null,null,null,null,null,null,null,null,null,null,null,null,null,null,"Eriyn"]
[null,"Créatures",null,null,null,null,null,null,null,null,null,null,null,null,null,null,null,null,null,null,null,null,null,null,null,null,null,null,null,null,null,null,null,null,null,null,null,null,null,52000]
[null,"Nom","Puissance","Cout or","Cout rares","ratio","Actuel","Domination ","Réserves","Domination","Coût","Croissance base","L?","Tot. Croissance","DomxJ","Colonne1","L1","L2","L3","L4",null,null,null,null,null,null,null,null,null,null,null,"(inferno)"]
["T1","Squelette",87,209,null,{"$f":"C5/(D5+E5*1000)","v":0.41626794258373206},5,{"$f":"C5*G5","v":435},41,{"$f":"I5*C5","v":3567},{"$f":"I5*D5","v":8569},15,1,{"$f":"L5+M5*R5+$Q$22","v":15},{"$f":"N5*C5","v":1305},"T1",3]
["T1+","Archer squelette",70,205,null,0.34146341463414637,51,{"$f":"C6*G6","v":3570},null,0,null,15,1,15,1050,"T1+",3,null,null,null,null,null,null,null,null,null,null,null,null,null,null,null,"J1","J2","J3","J4","J5","J6","J7","J8","J9"]
["T2","Zombie",134,361,null,0.37119113573407203,41,5494,22,2948,{"$f":"I7*D7","v":7942},10,0,10,1340,"T2",null,null,null,null,null,"Objectif",null,null,null,630,null,null,null,"Cimetière",1566,null,{"$f":"AG15","v":1},{"$f":"AH15","v":1},1,1,1,1,1,1,1,null,"enroleur 3 ?"]
["T2+","Zombie pestilentiel",160,433,null,0.36951501154734412,null,0,null,0,null,10,0,10,1600,"T2+",null,null,null,null,null,null,null,null,null,3600,11,8,null,"Crypte",1340,null,{"$f":"AG20","v":0},{"$f":"AH20","v":0},0,1,1,1,1,1,1]
["T3","Fantôme",303,760,null,0.39868421052631581,26,7878,16,4848,null,7,0,7,2121,"T3",null,null,null,null,null,null,null,null,null,5760,20,16,5,"Tour en ruine",2121,null,0,0,0,0,1,1,1,1,1]
["T3+","Spectre",364,912,null,0.39912280701754388,null,0,null,0,null,7,0,7,2548,"T3+",null,null,null,null,null,null,null,null,null,null,null,null,null,null,{"$f":"SUM(AE7:AE9)","v":5027}]
["T4","Vampire",751,1672,null,0.44916267942583732,2,1502,null,0,null,5,0,5,3755,"T4",null,null,null,null,null,null,null,null,null,null,null,null,null,null,"Total troupes",null,{"$f":"$L$5*$C$5*AG7+$L$7*$C$7*AG8+$L$9*$C$9*AG9+AF11","v":1305},{"$f":"$L$5*$C$5*AH7+$L$7*$C$7*AH8+$L$9*$C$9*AH9+AG11","v":2610},3915,6560,11326,16092,20858,25624,30390]
["T4+","Seigneur vampire",902,2006,null,0.44965104685942175,3,2706,null,0,null,5,0,5,4510,"T4+"]
["T5","Liche",1430,1000,2,0.47666666666666668,null,0,null,0,null,3,0,3,4290,"T5",null,null,null,null,null,null,null,null,null,null,null,null,null,null,"Total héros"]
["T5+","Archiliche",2144,1500,3,{"$f":"C14/(D14+E14*1000)","v":0.47644444444444445},null,0,null,0,null,3,0,3,6432,"T5+",null,null,null,null,null,null,null,null,null,null,null,null,null,"Taverne",100,null,1,1,1,1,1,1,1,1,1]
["T6","Revenant",2578,2000,3,{"$f":"C15/(D15+E15*1000)","v":0.51559999999999995},null,0,null,0,null,2,0,2,5156,"T6",null,null,null,null,null,null,null,null,null,null,null,null,null,"Cimetière",140,null,1,1,1,1,1,1,1,1,1]
["T6+","Apparition",3365,2500,4,{"$f":"C16/(D16+E16*1000)","v":0.51769230769230767},null,0,null,0,null,2,0,2,6730,"T6+",null,null,null,null,null,null,null,null,null,null,null,null,null,"Marché",170,null,1,1,1,1,1,1,1,1,1]
["T7","Dragon squelette",5866,null,10,{"$f":"C17/(D17+E17*1000)","v":0.58660000000000001},null,0,null,0,null,1,0,{"$f":"L17+M17*R17","v":1},5866,"T7",null,null,null,null,null,null,null,null,null,null,null,null,null,"Silo à ressources niveau 1",100,null,0,1,1,1,1,1,1,1,1]
["T7+","Dragon spectral",8213,null,14,{"$f":"C18/(D18+E18*1000)","v":0.58664285714285713},null,0,null,0,null,1,0,{"$f":"L18+M18*R21","v":1},8213,"T7+",null,null,null,null,null,null,null,null,null,null,null,null,null,"Conseil du village",2000,null,0,0,1,1,1,1,1,1,1]
[null,"sous-total 1",null,null,null,null,null,{"$f":"SUM(H5:H18)","v":21585},null,{"$f":"SUM(J5:J18)","v":11363},{"$f":"SUM(K5:K18)","v":16511},null,null,null,null,null,null,null,null,null,null,null,null,null,null,null,null,null,null,"Mairie",3000,null,0,0,0,0,0,1,1,1,1]
[null,null,null,null,null,null,null,null,null,null,null,null,null,null,null,null,null,null,null,null,null,{"$f":"5*C16","v":16825},null,null,null,null,null,null,null,"Crypte",800,null,0,0,0,1,1,1,1,1,1]
[null,"Bâtiments",null,null,null,null,null,null,null,null,null,null,null,null,null,null,"Chef charismatique",null,null,null,null,null,null,null,null,null,null,null,null,"Tour en ruine",3700,null,0,0,0,0,1,1,1,1,1]
[null,"Nom","Or","Bois","Pierre","Mercure","Domination",null,null,null,null,"Domination créée par jour",null,null,{"$f":"O5+O7+O11+O9","v":8521},null,0]
[null,"Conseil du village",0,null,null,null,2000,null,null,null,null,null,null,null,null,null,null,null,null,null,null,null,"Production des troupes (domination/Jour) avec chef chari",null,null,null,null,null,null,null,"Total bâtiments",null,{"$f":"$AE14*AG14+$AE15*AG15+$AE16*AG16+$AE17*AG17+$AE18*AG18+$AE19*AG19+$AE20*AG20+$AE21*AG21","v":410},510,2510,3310,7010,10010,10010,10010,10010]
[null,"Mairie",4500,10,6,null,3000,null,null,null,null,null,null,null,{"$f":"O5+O7+O9","v":4766},null,null,null,null,null,null,null,null,null,null,null,"MAX Hab. + champs",null,"Cout",null,null,"Total quêtes",804,1742,2954,4427,6248,8264,10517,13172,16229,19694,25414,32564]
[null,"Cimetière",630,null,null,null,140,null,null,null,null,null,null,null,null,null,null,null,null,null,null,null,"T1",1566,1740,1827,{"$f":"3+6+15+3*5*1.8","v":51},{"$f":"AA25*C5","v":4437},{"$f":"AA25*(D5+E5*2000)","v":10659},null,null,"Total général",{"$f":"AG11+AG23+AG24","v":2519},4862,9379,14297,24584,34366,41385,48806,56629]
[null,"Ossuaire",900,4,4,null,340,null,null,null,null,null,null,null,null,null,"Ratio","GG/",null,null,null,null,"T1+",1260,1400,1470,{"$f":"3+6+15+3*5*1.8","v":51},{"$f":"AA26*C6","v":3570},{"$f":"AA26*(D6+E6*2000)","v":10455}]
[null,"Crypte",3600,11,8,3,800,null,null,null,null,null,3816,"Seigneur des abimes",2700,"T",{"$f":"O27/M27","v":0.70754716981132071},3,null,null,null,null,"T2",1340,1608,1742,{"$f":"10+3+2*5*1.8","v":31},{"$f":"AA27*C7","v":4154},11191]
[null,"Silo à ressources niveau 1",500,3,2,null,100,null,null,null,null,null,4508,"Paladins",2900,"C",{"$f":"O28/M28","v":0.64330079858030165},1,null,null,null,null,"T2+",1600,1920,2080,{"$f":"10+3+2*5*1.8","v":31},{"$f":"AA28*C8","v":4960},13423]
[null,"Marché",765,5,4,null,170,null,null,null,null,null,3434,"Tréant séculaire",2700,"F",{"$f":"O29/M29","v":0.78625509609784505},4,null,null,null,null,"T3",2121,2727,3030,{"$f":"7+3+1*5*1.8","v":19},{"$f":"AA29*C9","v":5757},14440]
[null,"Taverne",450,4,3,null,100,null,null,null,null,null,3365,"Apparition",2500,"F",{"$f":"O30/M30","v":0.74294205052005946},2,null,null,null,null,"T3+",2548,3276,3640,{"$f":"7+3+1*5*1.8","v":19},{"$f":"AA30*C10","v":6916},17328]
[null,"sous-total 2",null,null,null,null,{"$f":"SUM(G23:G30)","v":6650},null,null,null,null,null,2950,"Raja Rakshasa",2300,"F",{"$f":"O31/M31","v":0.77966101694915257},1,null,null,null,null,"T4",3755,5257,6008,8,6008,13376]
[null,null,null,null,null,null,null,null,null,null,null,null,null,null,null,null,null,null,null,null,null,null,"T4+",4510,6314,7216,8,7216,16048]
[null,"sous-total 3 (?)",null,null,null,null,4859,"Il y a un delta de domination inconnu !",null,null,null,null,null,null,null,null,null,null,null,null,null,null,"T5",4290,7150,8580,6,8580,30000]
[null,null,null,null,null,null,null,null,null,null,null,null,null,null,null,null,null,null,null,null,null,null,"T5+",6432,10720,12864,6,12864,45000]
[null,null,null,null,null,null,null,null,null,null,null,null,null,null,null,null,null,null,null,null,null,null,"T6",5156,10312,12890,5,12890,40000]
[null,"TOTAL DOMINATION",null,null,null,null,{"$f":"H19+G31+G33","v":33094},23844,{"$f":"J19","v":11363},"12:28:00",null,null,null,null,null,null,null,null,null,null,null,null,"T6+",6730,13460,16825,5,16825,52500]
[null,null,null,null,null,null,null,null,null,null,null,null,null,null,null,null,null,null,null,null,null,null,"T7",5866,5866,5866,1,5866,20000]
[null,"TOTAL DOMINATION POSSIBLE",null,null,null,null,{"$f":"G36+I36","v":44457},null,null,null,null,null,null,null,null,null,null,null,null,null,null,null,"T7+",8213,8213,8213,1,8213,28000]

{"sheet":"Stratégie","index":3,"n_rows":132,"n_cols":45,"rows_kept":132,"cut":false,"hidden":false,"merged":[]}
[null,"Richesse",null,null,null,{"$f":"EXP(0.7741)","v":2.1686394730951211},null,null,null,"PALIER 2"]
[null,null,null,"2^x","2^x","e0,7741x",null,null,null,null,"La grosse erreur c'est de ne pas avoir su jouer et anticiper l'ordre des quêtes",null,null,null,null,null,null,null,"erreur: d'abord sur l'or avec le héros principal qui monte le plus vite"]
[null,null,"Niveaux","Domination","Richesse","Honneur",null,null,null,null,"Il faut se débrouiller pour associer chaque du secteur proche de la cité avec une quête de la section combat, y compris les mines. Cela est assez simple à faire si vous vous organisez un minimum.",null,null,null,null,null,null,null,"erreur: d'abord sur ressources communes"]
[null,null,1,34000,320000,15000,null,null,null,null,"Ne pas oublier de réserver une case extérieur pour la quête victoire écrasante qui se fera beaucoup plus tard mais dont la récompense est extrêmement intéressante.",null,null,null,null,null,null,null,"Mine des nains"]
[null,null,2,68000,640000,30000,null,null,null,null,"Ne pas trop attendre pour faire la guilde des mages"]
[null,null,3,136000,1280000,80000,null,1,5,null,"Viser l'invocation",null,null,null,null,null,null,null,"La recherche des points de ressource  via les combats est essentielle"]
[null,null,4,272000,2560000,160000,null,2,2,null,"Prendre une faction ayant des Troupes fortes + Magie de l'invocation",null,null,null,null,null,null,null,"cela accélère la production"]
[null,null,5,544000,5120000,320000,null,3,4,null,null,null,null,null,null,null,null,null,"Hotel de ville avant mine perf niv 8."]
[null,null,6,1088000,10240000,640000,null,4,8,null,"Le pallier 2 d'honneur est atteint en premier, en moins d'une semaine, en particulier par un inferno"]
[null,null,7,2176000,20480000,{"$f":"6899.8*EXP(0.7741*Tableau253[[#This Row],[Niveaux]])","v":1556496.0088188157},null,null,null,null,null,"Chance ?",null,null,null,null,"DANS CET ORDRE:",null,"http://pacte-enroth.forumactif.net/aide-de-jeu-f8/liens-utiles-t8.htm"]
[null,null,8,4352000,40960000,{"$f":"6899.8*EXP(0.7741*Tableau253[[#This Row],[Niveaux]])","v":3375478.6844394947},null,null,null,null,null,"Ensuite la domination est plus facile"]
[null,null,9,8704000,81920000,7680000,null,null,null,null,"Ne pas trop attendre pour faire la guilde des mages",null,null,null,null,"Heros 1","Or, Communes",null,"donc, changement de stratégie: rester sur l'amélioration des mines en attendant l'hotel de ville"]
[null,null,10," ??",163840000," ??",null,null,null,null,null,"Retard de 3 jours sur le niveau 2",null,null,null,"Heros 2","Marché, Rares",null,"la mine d'or perf ne rapporte pas assez en attendant le passage"]
[null,null,null,null,null,null,null,null,null,null,null,null,null,null,null,"Heros 3","Recrutement"]
[]
[]
[]
[null,"Date","2010-09-22T22:37:36.870","2010-09-22T22:37:36.870","2010-09-22T22:58:42.200","2010-09-23T00:49:50.570","2010-09-23T01:18:40.910","2010-09-23T08:10:14.890","2010-09-24T00:16:10.350","2010-09-24T19:37:42.970","2010-09-25T00:25:04.710","2010-09-25T21:22:20.940","2010-09-26T22:29:58.860","2010-09-29T02:03:40.250","2010-09-29T21:26:19.440"]
[null,"T0+x Heures",null,{"$f":"(D18-$C18)*24","v":0},0.35148055554600433,2.2038055555312894,2.6844555556308478,9.5438944445340894,25.642633333336562,45.001694444508757,49.791066666715778,{"$f":"(L18-$C18)*24","v":70.745575000124518},95.872774999996182,147.43427222227911,166.81182499998249]
[]
[null,"Eriyn"]
[null,"ES_Triben"]
[]
[]
[null,"Kazimohdõ",null,769567,770689,787357,789753,828983,932931,1051455,1094396,1227877,1429598,1909644,2106888]
[]
[]
[]
[]
[]
[]
[]
[]
[]
[]
[null,"Richesse / heure",null,null,null,null,null,null,null,null,null,null,null,null,null,null,null,null,null,null,null,{"$f":"V25-V29","v":0},0,0,0,0,0,0,0,0,0,0,0,0,0,0,0]
[null,"Palier",null,null,null,null,null,null,null,null,"progression/heure",{"$f":"(L25-J25)/(L19-J19)","v":6852.9684022914471},{"$f":"(O25-N25)/(O19-N19)","v":10178.994337559339}]
[null,"Temps restant",null,null,null,null,null,null,null,null,"palier à atteindre",1280000,2560000]
[null,"Rang 3",null,null,null,null,null,null,null,null,"Nb heures",{"$f":"(L38-MAX(C25:CE25))/L37","v":-120.66128886914333},{"$f":"(M38-MAX(D25:CF25))/M37","v":44.5144171392323},null,null,null,null,null,null,null,null,null,null,null,null,null,null,null,null,null,null,null,null,null,null,null,null,null,null,null,null,null,"2010-09-12T12:27:02.810","2010-09-12T22:27:30.250","2010-09-13T02:09:49.560"]
[null,null,"Palier","Richesse (M1)","Richesse (M2)",null,null,null,null,null,null,{"$f":"L18+L39/24","v":"2010-09-20T20:42:40.300"},{"$f":"O18+M39/24","v":"2010-10-01T17:57:11.342"},null,null,"Lois de régression"]
[null,null,1,null,null,null,null,null,null,null,null,null,"a","b","c","h)eures","f(h)",null,null,null,null,null,null,null,null,null,null,null,null,null,null,null,null,null,null,null,null,null,null,null,null,"kaz","y = 18,054x2 + 163,46x + 423184","y = 17,284x2 + 476,34x + 393472","y = 17,284x2 + 476,34x + 393472"]
[null,null,2,null,null,null,null,null,"Approximation de la richesse",null,null,"Expo.",335393.7702442109,1.0062633189902284,null,547.54465698595561,{"$f":"M42*N42^P42","v":10239999.99999252},null,null,null,null,null,null,null,null,null,null,null,null,null,null,null,null,null,null,null,null,null,null,null,null,"Jeb","y = 9,4774x2 + 2542,8x + 277030","y = 9,6161x2 + 2507,5x + 278458","y = 9,5543x2 + 2523,4x + 277800"]
[null,null,3,{"$f":"L40","v":"2010-09-20T20:42:40.300"},null,null,null,null,"Temps de passage des paliers",null,null,"Poly",18.12,97.509,432002,3000.3259500717718,{"$f":"M43*P43^2+N43*P43+O43","v":163839999.99999988},null,null,null,null,null,null,null,null,null,null,null,null,null,null,null,null,null,null,null,null,null,null,null,null,"Palladyn","y = 12,877x2 + 528,05x + 459270","y = 14,064x2 - 19,586x + 520008","y = 14,204x2 - 84,602x + 527249"]
[null,null,4,{"$f":"M40","v":"2010-10-01T17:57:11.342"},{"$f":"Villes!E5","v":"2010-10-01T18:44:42.300"},null,null,null,"Ville","Palier","Exp.","Delta (h)","Delta (j)","Poly","Delta (h)2","Delta (j)3","Total Jours",null,null,null,null,null,null,null,null,null,null,null,null,null,null,null,null,null,null,null,{"$f":"NOW()","v":"2010-09-29T23:41:22.700"},null,null,null,null,"Trib","y = 15,408x2 - 1251,1x + 667672","y = 16,611x2 - 1841,4x + 738291","y = 17,975x2 - 2515x + 819298"]
[null,null,5,null,null,null,null,null,1,320000,null,null,null,null,null,null,null,null,null,null,null,null,null,null,null,null,null,null,null,null,null,null,null,null,null,null,{"$f":"AK44+1+10/24","v":"2010-10-01T09:41:22.700"}]
[null,null,6,null,null,null,null,null,2,640000,103.48,null,null,104.48284868054205]
[null,null,7,null,null,null,null,null,3,1280000,214.50288293322095,{"$f":"K47-K46","v":111.02288293322094},{"$f":"L47/24","v":4.6259534555508726},213.65686687748772,{"$f":"N47-N46","v":109.17401819694567},{"$f":"O47/24","v":4.5489174248727364},{"$f":"P46+Tableau7[[#This Row],[Delta (j)3]]","v":4.5489174248727364}]
[null,null,8,null,null,null,null,null,4,2560000,325.51680763110909,{"$f":"K48-K47","v":111.01392469788814},{"$f":"L48/24","v":4.6255801957453393},340.01392503083298,126.35705815334526,{"$f":"O48/24","v":5.2648774230560527},{"$f":"P47+Tableau7[[#This Row],[Delta (j)3]]","v":9.81379484792879}]
[null,null,9,null,null,null,null,null,5,5120000,436.53073230859059,{"$f":"K49-K48","v":111.0139246774815},4.6255801948950621,505.96127457829618,165.9473495474632,6.9144728978109669,{"$f":"P48+Tableau7[[#This Row],[Delta (j)3]]","v":12.17935032086702}]
[null,null,10,null,null,null,null,null,6,10240000,547.54465698595561,{"$f":"K50-K49","v":111.01392467736503},4.6255801948902091,733.03177641766445,227.07050183936826,9.4612709099736776,{"$f":"P49+Tableau7[[#This Row],[Delta (j)3]]","v":16.375743807784644}]
[null,null,null,null,null,null,null,null,7,20480000,{"$f":"K50+L50","v":658.55858166332064},{"$f":"L50","v":111.01392467736503},4.6255801948902091,1049.1690860300268,316.1373096123624,13.172387900515099,{"$f":"P50+Tableau7[[#This Row],[Delta (j)3]]","v":22.633658810488775}]
[null,null,null,null,null,null,null,null,8,40960000,{"$f":"K51+L51","v":769.57250634068566},{"$f":"L51","v":111.01392467736503},4.6255801948902091,1492.8533091239071,443.68422309388029,18.486842628911678,{"$f":"P51+Tableau7[[#This Row],[Delta (j)3]]","v":31.659230529426779}]
[null,null,null,null,null,null,null,null,9,81920000,{"$f":"K52+L52","v":880.58643101805069},{"$f":"L52","v":111.01392467736503},4.6255801948902091,2117.9548626363662,625.10155351245908,26.045898063019127,{"$f":"P52+Tableau7[[#This Row],[Delta (j)3]]","v":44.532740691930805}]
[null,null,null,null,null,null,null,null,10,163840000,{"$f":"K53+L53","v":991.60035569541571},{"$f":"L53","v":111.01392467736503},4.6255801948902091,3000.3259500717718,882.37108743540557,36.76546197647523,{"$f":"P53+Tableau7[[#This Row],[Delta (j)3]]","v":62.81136003949436}]
[]
[null,null,null,null,null,null,null,null,null,null,null,null,{"$f":"SUM(M47:M54)","v":37.005014820642323},null,null,{"$f":"SUM(P47:P54)","v":120.66012922463457}]
[]
[]
[]
[]
[]
[]
[]
[]
[]
[]
[]
[]
[]
[]
[]
[]
[]
[]
[]
[]
[]
[]
[]
[]
[]
[]
[]
[]
[]
[]
[]
[]
[]
[]
[]
[]
[]
[]
[]
[]
[]
[]
[]
[]
[]
[]
[]
[]
[]
[]
[]
[]
[]
[]
[]
[]
[]
[]
[]
[]
[]
[]
[]
[]
[]
[]
[]
[]
[]
[]
[]
[]
[null,null,null,null,null,null,null,null,null,"12,033x2 + 911,44x + 417248",null,null,null,null,null,{"$f":"908-314","v":594}]
[null,null,null,null,null,null,null,null,null,"18,33x2 - 2664,1x + 834652",null,null,null,null,null,{"$f":"P129/24","v":24.75}]
[]
[null,null,null,null,null,null,null,null,{"$f":"12.033-18.33","v":-6.2969999999999988},{"$f":"911.44+2664.1","v":3575.54},{"$f":"417248-834652","v":-417404},null,1944299]

{"sheet":"Mines","index":4,"n_rows":42,"n_cols":20,"rows_kept":42,"cut":false,"hidden":false,"merged":[]}
[null,null,null,null,null," ",null,null,null,null,null,null,"EN x2"]
[null,null,"AMELIORATION"]
[null,null,null,null,"Cout passer au niv.",null,null,null,null,"Cout1","Revenus1","Revenus1"]
[null,"niv","Heures","T max","T med","T min","Heures",null,null,"Cumul","(ressource)","(or)"]
[null,1,null,null,0,null,null,null,null,0,2,2000,null,null,null,"Fin construction mine",null,null,"Début construction mine"]
[null,2,{"$f":"0.4*B6^2-2*B6+137/30","v":2.1666666666666665},{"$f":"7/5*E6","v":1400},1000,{"$f":"0.8*E6","v":800},{"$f":"0.8*B6^2-4*B6+257/30","v":3.7666666666666666},null,null,{"$f":"J5+E6","v":1000},4,4000]
[null,3,2.1666666666666665,2800,2000,{"$f":"0.8*E7","v":1600},{"$f":"0.8*B7^2-4*B7+257/30","v":3.7666666666666666},null,null,3000,6,6000]
[null,4,2.9666666666666668,4200,3000,2400,5.3666666666666671,null,null,6000,8,8000,null,null,null,"2010-09-01T05:34:00"]
[null,5,4.5666666666666664,7000,5000,4000,8.5666666666666664,null,null,11000,10,10000,null,{"$f":"SUM(G6:G10)","v":34.833333333333336},null,{"$f":"P8-G25/24","v":"2010-08-31T09:48:00"}]
[null,6,6.9666666666666668,{"$f":"7/5*E10","v":11200},8000,6400,13.366666666666667,null,null,19000,12,12000]
[null,7,10.166666666666668,18200,13000,10400,19.766666666666669,null,null,32000,14,14000]
[null,8,14.166666666666668,{"$f":"7/5*E12","v":29399.999999999996},21000,16800,27.766666666666669,null,null,53000,16,16000,null,"10h de plus!"]
[null,9,18.966666666666665,47600,34000,{"$f":"0.8*E13","v":27200},37.36666666666666,null,null,87000,18,18000,null,null,null,"2010-09-01T13:09:05",19.766666666666669,{"$f":"Q13-Q13*27%","v":14.42966666666667},{"$f":"P13-R13/24","v":"2010-08-31T22:43:18.200"}]
[null,10,24.566666666666666,77000,55000,44000,48.566666666666663,null,null,142000,20,20000]
[]
[null,null,"PERFECTIONNEMENT"]
[null,null,null,null,"Cout passer au niv.",null,null,null,null,"Cout2","Revenus2","Revenus2"]
[null,null,"Heures","T max","T med","T min","Heures",null,"xp","Cumul","(ressource)","(or)"]
[null,1,null,null,{"$f":"1000*B5^2-1000*B5","v":0},null,null,null,{"$f":"80*B19^2-80*B19","v":0},0,2,{"$f":"H19*L5+L5","v":2000}]
[null,2,{"$f":"0.4*B20^2-2*B20+137/30","v":2.1666666666666665},{"$f":"1400*B20^2-1400*B20","v":2800},2000,{"$f":"800*B20^2-800*B20","v":1600},{"$f":"0.8*B20^2-4*B20+257/30","v":3.7666666666666666},0.05,{"$f":"80*B20^2-80*B20","v":160},{"$f":"J19+E20","v":2000},{"$f":"H20*K6+K6","v":4.2},4200]
[null,3,2.1666666666666665,8400,6000,4800,{"$f":"0.8*B21^2-4*B21+257/30","v":3.7666666666666666},0.1,480,8000,6.6,6600]
[null,4,2.9666666666666668,16800,12000,9600,5.3666666666666671,0.15,960,20000,9.1999999999999993,9200]
[null,5,4.5666666666666664,28000,20000,16000,8.5666666666666664,0.2,1600,40000,12,12000]
[null,6,6.9666666666666668,42000,30000,24000,13.366666666666667,0.25,2400,70000,15,15000]
[null,7,10.166666666666668,58800,42000,33600,19.766666666666669,0.3,3360,112000,18.2,18200]
[null,8,14.166666666666668,78400,56000,44800,{"$f":"0.8*B26^2-4*B26+257/30","v":27.766666666666669},0.35,4480,168000,21.6,21600]
[null,9,18.966666666666665,100800,72000,{"$f":"800*B27^2-800*B27","v":57600},37.36666666666666,0.4,5760,240000,25.2,25200,null,null,{"$f":"SUM(G25:G27)/24","v":3.5375000000000001}]
[null,10,24.566666666666666,126000,90000,{"$f":"800*B28^2-800*B28","v":72000},48.566666666666663,0.45,7200,330000,29,29000]
[null,null,null,null,null,null,null,null,null,null,null,null,null,null,"En termes de couts :"]
[null,null,null,null,null,null,null,null,null,null,null,null,null,"Une mine améliorée niveau 9 = mine perfectionnée niveau 7 !",null,null,null,null,"Sauf qu'une mine en cours de perf ne rapporte rien !"]
[null,null,null,null,null,null,null,null,null,null,null,{"$f":"J5-J19","v":0},null,null,"Sauf que "]
[null,null,null,null,null,null,null,null,null,null,null,null,null,null,"niveau 9 amel = 27+37 heures en plus"]
[null,null,null,null,null,null,null,null,null,null,null,null,null,null,"niveau 7 perf. = interruption de production pendant 28 heures"]
[null,null,null,null,null,null,null,null,null,null,null,null,null,null,"Jusqu'à 18 ressources par jour : monter classique"]
[null,null,null,null,null,null,null,null,null,null,null,null,null,null,"Plus de 18 ressources par jour : monter avec amélioration"]
[null,null,null,null,null,null,null,null,null,null,null,null,null,null,null,null,null,"Encore que … discutable compte tenu du temps passé à améliorer…"]
[null,null,null,null,null,null,null,null,null,null,null,null,null,null,"l'amélioration bloques le progrès des héros un seul h devient actif"]
[]
[null,null,null,null,null,null,null,null,null,null,null,null,null,null,null,"XP rapportés"]
[]
[null,null,null,null,null,null,null,null,null,null,null,null,null,null,null,"A",7,1040,1040,24.76190476]
[null,null,null,null,null,null,null,null,null,null,null,null,null,null,null,"A",6,796.8,796.8,26.56]

{"sheet":"Bâtiments","index":5,"n_rows":233,"n_cols":41,"rows_kept":233,"cut":false,"hidden":false,"merged":[]}
[null,null,null,null,null,null,null,null,null,null,null,null,null,null,null,null,null,null,null,null,null,null,null,null,null,"Coloniser : première ville"]
[null,null,null,null,null,null,null,null,null,null,null,null,null,null,null,null,null,null,null,null,null,null,null,null,null,"Cout des colonies"]
[null,null,null,null,null,null,null,null,null,null,null,null,null,null,null,null,null,null,null,null,null,null,null,null,"2ème",20000,20,20]
[]
[null,null,null,null,null,null,null,null,null,null,null,null,null,null,null,null,null,null,null,null,null,null,null,null,"3ième"]
[null,null,null,null,null,null,null,null,null,null,null,null,null,null,null,null,null,null,null,null,null,null,null,null,null,210000,50,50,"(1 case)"]
[null,null,null,null,null,null,null,null,null,null,null,null,null,"MIN",null,null,null,null,null,null,null,null,null,null,null,130000,50,50]
[null,"210 bâtiments","http://mmhk.jactari.info/b%C3%A2timents",null,null,null,null,null,null,null,null,null,null,null,null,null,null,null,null,null,null,null,null,null,null,60000,50,50]
[null,"Nom","Faction","Catégorie","or","bois","minerai","mercure","cristal","soufre","gemme","Or2","bois3","minerai4","mercure5","cristal6","soufre7","gemme8","Acquis","Colonne1"]
[null,"Conseil du village","Académie","administration",0,null,null,null,null,null,null,0,null,null,null,null,null,null,null,{"$f":"Q10*S10","v":0}]
[null,"Conseil du village","Havre","administration",0,null,null,null,null,null,null,0,null,null,null,null,null,null,null,0]
[null,"Conseil du village","Inferno","administration",0,null,null,null,null,null,null,0,null,null,null,null,null,null,null,0]
[null,"Conseil du village","Nécropole","administration",0,null,null,null,null,null,null,null,null,null,null,null,null,null,null,0]
[null,"Conseil du village","Sylvan","administration",0,null,null,null,null,null,null,0,null,null,null,null,null,null,null,0]
[null,"Guilde des mages niveau 5","Académie","magie",108000,36,50,18,18,18,18,108000,null,null,null,null,null,null,null,0]
[null,"Mairie","Nécropole","administration",4500,10,6,null,null,null,null,null,null,null,null,null,null,null,null,0]
[null,"Cimetière","Nécropole","recrutement",630,null,null,null,null,null,null,null,null,null,null,null,null,null,null,0]
[null,"Arbre des fées","Sylvan","recrutement",630,null,null,null,null,null,null,630,null,null,null,null,null,null,null,0]
[null,"Mairie","Académie","administration",6000,8,10,null,null,null,null,6000,null,null,null,null,null,null,null,0]
[null,"Silo à ressources niveau 2","Académie","autre",1000,null,null,null,null,null,null,1000,null,null,null,null,null,null,null,0]
[null,"Silo à ressources niveau 3","Académie","autre",1500,null,null,null,null,null,null,1500,null,null,null,null,null,null,null,0]
[null,"Silo à ressources niveau 4","Académie","autre",2000,null,null,null,null,null,null,2000,null,null,null,null,null,null,null,0]
[null,"Silo à ressources niveau 5","Académie","autre",2500,null,null,null,null,null,null,2500,null,null,null,null,null,null,null,0]
[null,"Silo à ressources niveau 6","Académie","autre",3000,null,null,null,null,null,null,3000,null,null,null,null,null,null,null,0]
[null,"Silo à ressources niveau 7","Académie","autre",3500,null,null,null,null,null,null,3500,null,null,null,null,null,null,null,0]
[null,"Silo à ressources niveau 8","Académie","autre",4000,null,null,null,null,null,null,4000,null,null,null,null,null,null,null,0]
[null,"Silo à ressources niveau 9","Académie","autre",4500,null,null,null,null,null,null,4500,null,null,null,null,null,null,null,0]
[null,"Silo à ressources niveau 10","Académie","autre",5000,null,null,null,null,null,null,5000,null,null,null,null,null,null,null,0]
[null,"Atelier des gremlins","Académie","recrutement",700,null,null,null,null,null,null,700,null,null,null,null,null,null,null,0]
[null,"Silo à ressources niveau 2","Havre","autre",1000,null,null,null,null,null,null,1000,null,null,null,null,null,null,null,0]
[null,"Silo à ressources niveau 3","Havre","autre",1500,null,null,null,null,null,null,1500,null,null,null,null,null,null,null,0]
[null,"Silo à ressources niveau 4","Havre","autre",2000,null,null,null,null,null,null,2000,null,null,null,null,null,null,null,0]
[null,"Silo à ressources niveau 5","Havre","autre",2500,null,null,null,null,null,null,2500,null,null,null,null,null,null,null,0]
[null,"Silo à ressources niveau 6","Havre","autre",3000,null,null,null,null,null,null,3000,null,null,null,null,null,null,null,0]
[null,"Silo à ressources niveau 7","Havre","autre",3500,null,null,null,null,null,null,3500,null,null,null,null,null,null,null,0]
[null,"Silo à ressources niveau 8","Havre","autre",4000,null,null,null,null,null,null,4000,null,null,null,null,null,null,null,0]
[null,"Silo à ressources niveau 9","Havre","autre",4500,null,null,null,null,null,null,4500,null,null,null,null,null,null,null,0]
[null,"Silo à ressources niveau 10","Havre","autre",5000,null,null,null,null,null,null,5000,null,null,null,null,null,null,null,0]
[null,"Huttes de paysans","Havre","recrutement",700,null,null,null,null,null,null,700,null,null,null,null,null,null,null,0]
[null,"Silo à ressources niveau 2","Inferno","autre",1000,null,null,null,null,null,null,1000,null,null,null,null,null,null,null,0]
[null,"Silo à ressources niveau 3","Inferno","autre",1500,null,null,null,null,null,null,1500,null,null,null,null,null,null,null,0]
[null,"Silo à ressources niveau 4","Inferno","autre",2000,null,null,null,null,null,null,2000,null,null,null,null,null,null,null,0]
[null,"Silo à ressources niveau 5","Inferno","autre",2500,null,null,null,null,null,null,2500,null,null,null,null,null,null,null,0]
[null,"Silo à ressources niveau 6","Inferno","autre",3000,null,null,null,null,null,null,3000,null,null,null,null,null,null,null,0]
[null,"Silo à ressources niveau 7","Inferno","autre",3500,null,null,null,null,null,null,3500,null,null,null,null,null,null,null,0]
[null,"Silo à ressources niveau 8","Inferno","autre",4000,null,null,null,null,null,null,4000,null,null,null,null,null,null,null,0]
[null,"Silo à ressources niveau 9","Inferno","autre",4500,null,null,null,null,null,null,4500,null,null,null,null,null,null,null,0]
[null,"Silo à ressources niveau 10","Inferno","autre",5000,null,null,null,null,null,null,5000,null,null,null,null,null,null,null,0]
[null,"Silo à ressources niveau 2","Nécropole","autre",1000,null,null,null,null,null,null,null,null,null,null,null,null,null,null,0]
[null,"Silo à ressources niveau 3","Nécropole","autre",1500,null,null,null,null,null,null,null,null,null,null,null,null,null,null,0]
[null,"Silo à ressources niveau 4","Nécropole","autre",2000,null,null,null,null,null,null,null,null,null,null,null,null,null,null,0]
[null,"Silo à ressources niveau 5","Nécropole","autre",2500,null,null,null,null,null,null,null,null,null,null,null,null,null,null,0]
[null,"Silo à ressources niveau 6","Nécropole","autre",3000,null,null,null,null,null,null,null,null,null,null,null,null,null,null,0]
[null,"Silo à ressources niveau 7","Nécropole","autre",3500,null,null,null,null,null,null,null,null,null,null,null,null,null,null,0]
[null,"Silo à ressources niveau 8","Nécropole","autre",4000,null,null,null,null,null,null,null,null,null,null,null,null,null,null,0]
[null,"Silo à ressources niveau 9","Nécropole","autre",4500,null,null,null,null,null,null,null,null,null,null,null,null,null,null,0]
[null,"Silo à ressources niveau 10","Nécropole","autre",5000,null,null,null,null,null,null,null,null,null,null,null,null,null,null,0]
[null,"Silo à ressources niveau 2","Sylvan","autre",1000,null,null,null,null,null,null,1000,null,null,null,null,null,null,null,0]
[null,"Silo à ressources niveau 3","Sylvan","autre",1500,null,null,null,null,null,null,1500,null,null,null,null,null,null,null,0]
[null,"Silo à ressources niveau 4","Sylvan","autre",2000,null,null,null,null,null,null,2000,null,null,null,null,null,null,null,0]
[null,"Silo à ressources niveau 5","Sylvan","autre",2500,null,null,null,null,null,null,2500,null,null,null,null,null,null,null,0]
[null,"Silo à ressources niveau 6","Sylvan","autre",3000,null,null,null,null,null,null,3000,null,null,null,null,null,null,null,0]
[null,"Silo à ressources niveau 7","Sylvan","autre",3500,null,null,null,null,null,null,3500,null,null,null,null,null,null,null,0]
[null,"Silo à ressources niveau 8","Sylvan","autre",4000,null,null,null,null,null,null,4000,null,null,null,null,null,null,null,0]
[null,"Silo à ressources niveau 9","Sylvan","autre",4500,null,null,null,null,null,null,4500,null,null,null,null,null,null,null,0]
[null,"Silo à ressources niveau 10","Sylvan","autre",5000,null,null,null,null,null,null,5000,null,null,null,null,null,null,null,0]
[null,"Colisée des tempêtes","Académie","recrutement",160000,78,105,null,null,30,50,160000,null,null,null,null,null,null,null,0]
[null,"Sépulcre des dragons","Nécropole","recrutement",171000,73,52,50,48,null,null,null,null,null,null,null,null,null,null,0]
[null,"Autel des cieux","Havre","recrutement",190000,99,110,null,40,null,null,190000,null,null,null,null,null,null,null,0]
[null,"Guilde des mages niveau 4","Académie","magie",39000,38,34,9,9,9,9,39000,null,null,null,null,null,null,null,0]
[null,"Mairie","Havre","administration",5000,10,12,null,null,null,null,5000,null,null,null,null,null,null,null,0]
[null,"Sanctuaire des dragons","Sylvan","recrutement",190000,136,81,19,null,null,27,190000,null,null,null,null,null,null,null,0]
[null,"Palais des tortures","Inferno","recrutement",218000,69,100,15,null,30,null,218000,null,null,null,null,null,null,null,0]
[null,"Mairie","Inferno","administration",6000,11,10,null,null,null,null,6000,null,null,null,null,null,null,null,{"$f":"Q74*S74","v":0}]
[null,"Mairie","Sylvan","administration",4500,13,11,null,null,null,null,4500,null,null,null,null,null,null,null,0]
[null,"Château","Académie","défense",65000,62,68,null,null,null,null,65000,null,null,null,null,null,null,null,0]
[null,"Guilde des mages niveau 5","Nécropole","magie",144000,72,106,24,24,24,24,null,null,null,null,null,null,null,null,0]
[null,"Creuset de diablotins","Inferno","recrutement",840,null,null,null,null,null,null,840,null,null,null,null,null,null,null,0]
[null,"Capitole","Nécropole","administration",108000,105,61,null,null,null,null,null,null,null,null,null,null,null,null,0]
[null,"Château","Nécropole","défense",64800,70,51,20,null,null,null,null,null,null,null,null,null,null,null,0]
[null,"Forge de guerre","Nécropole","recrutement",4500,9,6,null,null,null,null,null,null,null,null,null,null,null,null,0]
[null,"Capitole","Académie","administration",120000,83,85,null,null,null,null,120000,null,null,null,null,null,null,null,0]
[null,"Cathédrale des lamentations","Nécropole","recrutement",63000,56,58,30,21,null,null,null,null,null,null,null,null,null,null,0]
[null,"Alcôve de tréant","Sylvan","recrutement",63000,76,79,12,null,null,21,63000,null,null,null,null,null,null,null,0]
[null,"Château","Sylvan","défense",64800,110,78,null,null,null,null,64800,null,null,null,null,null,null,null,0]
[null,"Capitole","Sylvan","administration",108000,137,77,null,null,null,null,108000,null,null,null,null,null,null,null,0]
[null,"Château de vampire","Nécropole","recrutement",21600,47,16,12,null,null,null,null,null,null,null,null,null,null,null,0]
[null,"Château","Havre","défense",72000,95,92,null,null,null,null,72000,null,null,null,null,null,null,null,0]
[null,"Guilde des mages niveau 3","Académie","magie",15000,23,21,5,5,5,5,15000,null,null,null,null,null,null,null,0]
[null,"Forge de guerre","Inferno","recrutement",6000,6,8,null,null,null,null,6000,null,null,null,null,null,null,null,0]
[null,"Ordre des paladins","Havre","recrutement",70000,84,97,null,24,null,null,70000,null,null,null,null,null,null,null,0]
[null,"Guilde des mages niveau 4","Nécropole","magie",52000,42,64,12,12,12,12,null,null,null,null,null,null,null,null,0]
[null,"Pavillon d'or","Académie","recrutement",70000,44,93,null,null,15,33,70000,null,null,null,null,null,null,null,0]
[null,"Cœur des abimes","Inferno","recrutement",84000,70,75,10,null,25,null,84000,null,null,null,null,null,null,null,0]
[null,"Capitole","Inferno","administration",144000,97,96,null,null,null,null,144000,null,null,null,null,null,null,null,0]
[null,"Guilde des mages niveau 2","Académie","magie",6000,10,9,2,2,2,2,6000,null,null,null,null,null,null,null,0]
[null,"Château","Inferno","défense",95000,77,69,null,null,22,null,95000,null,null,null,null,null,null,null,0]
[null,"Parapet d'obsidienne","Académie","recrutement",6600,7,11,null,null,null,null,6600,null,null,null,null,null,null,null,0]
[null,"Écuries de cauchemar","Inferno","recrutement",32400,39,31,8,null,7,null,32400,null,null,null,null,null,null,null,0]
[null,"Capitole","Havre","administration",120000,133,132,null,null,null,null,120000,null,null,null,null,null,null,null,0]
[null,"Citadelle","Académie","défense",32000,33,50,null,null,null,null,32000,null,null,null,null,null,null,null,0]
[null,"Citadelle","Sylvan","défense",28800,52,38,null,null,null,null,28800,null,null,null,null,null,null,null,0]
[null,"Guilde des mages niveau 5","Inferno","magie",216000,117,118,36,36,36,36,216000,null,null,null,null,null,null,null,0]
[null,"Forge de guerre","Académie","recrutement",6000,8,11,null,null,null,null,6000,null,null,null,null,null,null,null,0]
[null,"Cromlech","Sylvan","recrutement",21600,49,55,null,null,null,8,21600,null,null,null,null,null,null,null,0]
[null,"Tour des arbalétriers","Havre","recrutement",5500,11,12,null,null,null,null,5500,null,null,null,null,null,null,null,0]
[null,"Tour des archimages","Académie","recrutement",24000,39,44,null,null,7,10,24000,null,null,null,null,null,null,null,0]
[null,"Hall des péchés","Inferno","recrutement",28800,42,38,5,null,10,null,28800,null,null,null,null,null,null,null,0]
[null,"Guilde des mages niveau 1","Académie","magie",3240,5,5,null,null,null,null,3240,null,null,null,null,null,null,null,0]
[null,"Forge de guerre","Sylvan","recrutement",4500,13,11,null,null,null,null,4500,null,null,null,null,null,null,null,0]
[null,"Jardin des licornes","Sylvan","recrutement",24300,56,38,6,null,null,15,24300,null,null,null,null,null,null,null,0]
[null,"Guilde des mages niveau 5","Sylvan","magie",234000,131,124,42,42,42,42,234000,null,null,null,null,null,null,null,0]
[null,"Citadelle","Nécropole","défense",28800,45,34,14,null,null,null,null,null,null,null,null,null,null,null,0]
[null,"Forge de guerre","Havre","recrutement",5000,11,13,null,null,null,null,5000,null,null,null,null,null,null,null,0]
[null,"Bastion des griffons","Havre","recrutement",24000,64,63,null,null,null,null,24000,null,null,null,null,null,null,null,0]
[null,"Citadelle","Inferno","défense",38400,41,37,null,null,8,null,38400,null,null,null,null,null,null,null,0]
[null,"Crypte putride","Nécropole","recrutement",4950,10,7,5,null,null,null,null,null,null,null,null,null,null,null,0]
[null,"Citadelle","Havre","défense",32000,56,52,null,null,null,null,32000,null,null,null,null,null,null,null,0]
[null,"Guilde des mages niveau 5","Havre","magie",252000,126,148,42,42,42,42,252000,null,null,null,null,null,null,null,0]
[null,"Hôtel de ville","Académie","administration",27500,25,48,null,null,null,null,27500,null,null,null,null,null,null,null,0]
[null,"Guilde des mages niveau 3","Nécropole","magie",22000,32,25,7,7,7,7,null,null,null,null,null,null,null,null,0]
[null,"Autel des dragons","Sylvan","recrutement",117000,115,100,13,null,null,22,117000,null,null,null,null,null,null,null,0]
[null,"Colisée des nuages","Académie","recrutement",120000,70,100,null,null,23,37,120000,null,null,null,null,null,null,null,0]
[null,"Cimetière des dragons","Nécropole","recrutement",117000,90,63,45,33,null,null,null,null,null,null,null,null,null,null,0]
[null,"Hôtel de ville","Inferno","administration",33000,39,31,null,null,null,null,33000,null,null,null,null,null,null,null,0]
[null,"Hôtel de ville","Nécropole","administration",24750,49,38,null,null,null,null,null,null,null,null,null,null,null,null,0]
[null,"Pavillon de chasse","Sylvan","recrutement",9450,29,21,null,null,null,5,9450,null,null,null,null,null,null,null,0]
[null,"Tour hantée","Nécropole","recrutement",9450,20,17,12,null,null,null,null,null,null,null,null,null,null,null,0]
[null,"Autel de la lumière","Havre","recrutement",140000,115,115,null,26,null,null,140000,null,null,null,null,null,null,null,0]
[null,"Fonderie de golems","Académie","recrutement",10500,18,29,null,null,null,6,10500,null,null,null,null,null,null,null,0]
[null,"Tombes profanées","Nécropole","autre",18000,26,26,null,null,null,null,null,null,null,null,null,null,null,null,0]
[null,"Arène de la lame dansante","Sylvan","recrutement",4950,15,11,null,null,null,3,4950,null,null,null,null,null,null,null,0]
[null,"Cathédrale","Havre","recrutement",27000,49,54,6,14,6,6,27000,null,null,null,null,null,null,null,0]
[null,"Guilde des mages niveau 4","Inferno","magie",78000,77,85,18,18,18,18,78000,null,null,null,null,null,null,null,0]
[null,"Mausolée","Nécropole","recrutement",24300,41,26,20,15,9,9,null,null,null,null,null,null,null,null,0]
[null,"Pinacle des vœux","Académie","recrutement",27000,25,53,null,null,23,22,27000,null,null,null,null,null,null,null,0,null,null,"Max1","Max2",null,null,null,1,2,null,null,null,"Min1","Min2"]
[null,"Garnison","Havre","recrutement",10500,33,29,null,null,null,null,10500,null,null,null,null,null,null,null,0]
[null,"Palais des tourments","Inferno","recrutement",180000,85,85,10,null,24,null,180000,null,null,null,null,null,null,null,{"$f":"Q138*S138","v":0},null,null,19,16,null,null,null,13,11,null,null,null,11,9]
[null,"Hôtel de ville","Sylvan","administration",24750,60,40,null,null,null,null,24750,null,null,null,null,null,null,null,0,null,{"$f":"1.4*AA139","v":5600},13,12,null,null,4000,9,8,null,null,{"$f":"AA139/1.25","v":3200},8,7,null,null,"Tour des archers",null,{"$f":"AA139/AF139","v":1.25},1.125,1.1428571428571428]
[null,"Guilde des mages niveau 4","Sylvan","magie",84500,71,73,21,21,21,21,84500,null,null,null,null,null,null,null,0,null,{"$f":"1.4*AA140","v":5600},19,19,null,null,4000,13,13,null,null,{"$f":"AA140/1.25","v":3200},11,11,null,null,"Forge",null,1.25,1.1818181818181819,1.1818181818181819]
[null,"Guilde des mages niveau 2","Nécropole","magie",8000,22,16,2,2,2,2,null,null,null,null,null,null,null,null,0,null,null,null,null,null,null,19800,40,28,null,null,null,34,24,null,null,"Vampires"]
[null,"Bastion des cornus","Inferno","recrutement",6600,9,8,2,null,6,null,6600,null,null,null,null,null,null,null,0,null,null,null,null,null,null,3600,8,9,null,null,2880,7,8,null,null,"guilde magie",null,{"$f":"AA142/AF142","v":1.25},1.1428571428571428,1.125]
[null,"Hall des horreurs","Inferno","autre",24000,25,25,null,null,null,null,24000,null,null,null,null,null,null,null,0,null,10080,34,27,9,"11h12m46s",7200,24,19,6,"14h58s",5760,20,16,5,"22h25m23s","Tour en ruines",null,1.25,1.2,1.1875]
[null,"Hôtel de ville","Havre","administration",27500,53,53,null,null,null,null,27500,null,null,null,null,null,null,null,0,null,null,null,null,null,null,24750,49,38,null,"1d 2h 24min",{"$f":"AA144/1.25","v":19800},{"$f":"CEILING(AB144/1.25,1)","v":40},{"$f":"CEILING(AC144/1.25,1)","v":31},null,"39,75h"]
[null,"Caverne au trésor","Académie","autre",20000,30,30,null,null,null,null,20000,null,null,null,null,null,null,null,0]
[null,"Fermes","Havre","autre",20000,30,30,null,null,null,null,20000,null,null,null,null,null,null,null,0]
[null,"Hall des lamentations","Nécropole","recrutement",51300,72,50,22,12,null,null,null,null,null,null,null,null,null,null,0]
[null,"Pousses de tréant","Sylvan","autre",22000,30,30,null,null,null,null,22000,null,null,null,null,null,null,null,0]
[null,"Guilde des mages niveau 1","Nécropole","magie",3600,8,9,null,null,null,null,null,null,null,null,null,null,null,null,0]
[null,"Antichambre des abimes","Inferno","recrutement",68400,63,65,7,null,14,null,68400,null,null,null,null,null,null,null,0]
[null,"Chenils corrompus","Inferno","recrutement",12600,23,26,5,null,8,null,12600,null,null,null,null,null,null,null,0]
[null,"Guilde des mages niveau 4","Havre","magie",91000,108,109,21,21,21,21,91000,null,null,null,null,null,null,null,0]
[null,"Tour des griffons","Havre","recrutement",22000,38,38,null,null,null,null,22000,null,null,null,null,null,null,null,0]
[null,"Forge","Nécropole","recrutement",3600,8,7,null,null,null,null,null,null,null,null,null,null,null,null,0]
[null,"Fortin","Académie","défense",12000,18,25,null,null,null,null,12000,null,null,null,null,null,null,null,0]
[null,"Pavillon d'argent","Académie","recrutement",57000,56,80,null,null,10,25,57000,null,null,null,null,null,null,null,0]
[null,"Manoir de vampires","Nécropole","recrutement",19800,40,28,8,null,null,null,null,null,null,null,null,null,null,null,0]
[null,"Arche de tréant","Sylvan","recrutement",51300,92,80,8,null,null,17,51300,null,null,null,null,null,null,null,0]
[null,"Ossuaire","Nécropole","recrutement",900,4,4,null,null,null,null,null,null,null,null,null,null,null,null,0]
[null,"Manufacture des gremlins","Académie","recrutement",1000,4,4,null,null,null,null,1000,null,null,null,null,null,null,null,0]
[null,"Fortin","Nécropole","défense",10800,23,15,6,null,null,null,null,null,null,null,null,null,null,null,0]
[null,"Tour des archers","Havre","recrutement",4000,9,8,null,null,null,null,4000,null,null,null,null,null,null,null,0]
[null,"Guilde des mages niveau 3","Inferno","magie",30000,56,43,11,11,11,11,30000,null,null,null,null,null,null,null,0]
[null,"Fortin","Sylvan","défense",10800,29,25,null,null,null,null,10800,null,null,null,null,null,null,null,0]
[null,"Écuries infernales","Inferno","recrutement",27600,33,35,6,null,5,null,27600,null,null,null,null,null,null,null,0]
[null,"Hall des tentations","Inferno","recrutement",26400,32,33,3,null,8,null,26400,null,null,null,null,null,null,null,0]
[null,"Lice","Havre","recrutement",80000,92,92,null,15,null,null,80000,null,null,null,null,null,null,null,0]
[null,"Fortin","Inferno","défense",14400,21,21,null,null,4,null,14400,null,null,null,null,null,null,null,0]
[null,"Tour des mages","Académie","recrutement",22000,32,45,null,null,5,7,22000,null,null,null,null,null,null,null,0]
[null,"Cercle des pierres","Sylvan","recrutement",19800,52,45,null,null,null,5,19800,null,null,null,null,null,null,null,0]
[null,"Caveau","Nécropole","recrutement",20700,37,25,14,6,3,3,null,null,null,null,null,null,null,null,0]
[null,"Fortin","Havre","défense",12000,29,29,null,null,null,null,12000,null,null,null,null,null,null,null,0]
[null,"Guilde des mages niveau 3","Sylvan","magie",32500,54,49,13,13,13,13,32500,null,null,null,null,null,null,null,0]
[null,"Forge","Inferno","recrutement",4800,9,9,null,null,null,null,4800,null,null,null,null,null,null,null,0]
[null,"Forge","Académie","recrutement",4000,8,12,null,null,null,null,4000,null,null,null,null,null,null,null,0]
[null,"Parapet de pierre","Académie","recrutement",4800,8,11,null,null,null,null,4800,null,null,null,null,null,null,null,0]
[null,"Guilde des mages niveau 1","Inferno","magie",5400,12,11,null,null,null,null,5400,null,null,null,null,null,null,null,0]
[null,"Bois des fées","Sylvan","recrutement",900,6,5,null,null,null,null,900,null,null,null,null,null,null,null,0]
[null,"Clairière des licornes","Sylvan","recrutement",20700,59,50,3,null,null,9,20700,null,null,null,null,null,null,null,0]
[null,"Guilde des mages niveau 2","Inferno","magie",12000,27,27,4,4,4,4,12000,null,null,null,null,null,null,null,0]
[null,"Tour des cornus","Inferno","recrutement",4800,7,6,1,null,3,null,4800,null,null,null,null,null,null,null,0]
[null,"Forge","Sylvan","recrutement",3600,13,11,null,null,null,null,3600,null,null,null,null,null,null,null,0]
[null,"Terrasse de la lame dansante","Sylvan","recrutement",3600,14,10,null,null,null,null,3600,null,null,null,null,null,null,null,0]
[null,"Autel des vœux","Académie","recrutement",23000,34,44,null,null,15,14,23000,null,null,null,null,null,null,null,0]
[null,"Guilde des mages niveau 2","Sylvan","magie",13000,32,25,4,4,4,4,13000,null,null,null,null,null,null,null,0]
[null,"Guilde des mages niveau 3","Havre","magie",35000,76,64,13,13,13,13,35000,null,null,null,null,null,null,null,0]
[null,"Forge de golems","Académie","recrutement",8000,20,20,null,null,null,4,8000,null,null,null,null,null,null,null,0]
[null,"Crypte","Nécropole","recrutement",3600,11,8,3,null,null,null,null,null,null,null,null,null,null,null,0]
[null,"Chaumières de paysans","Havre","recrutement",1000,6,6,null,null,null,null,1000,null,null,null,null,null,null,null,0]
[null,"Monastère","Havre","recrutement",31000,45,41,4,10,4,4,31000,null,null,null,null,null,null,null,0]
[null,"Guilde des mages niveau 1","Sylvan","magie",5850,13,13,null,null,null,null,5850,null,null,null,null,null,null,null,0]
[null,"Creuset de familiers","Inferno","recrutement",1200,5,5,null,null,1,null,1200,null,null,null,null,null,null,null,0]
[null,"Forge","Havre","recrutement",4000,13,13,null,null,null,null,4000,null,null,null,null,null,null,null,0]
[null,"Tour en ruines","Nécropole","recrutement",7200,24,19,6,null,null,null,5760,20,16,5,null,null,null,"14h58","22h25"]
[null,"Chenils","Inferno","recrutement",9600,20,19,2,null,6,null,9600,null,null,null,null,null,null,null,0]
[null,"Loge de chasse","Sylvan","recrutement",7200,28,26,null,null,null,3,7200,null,null,null,null,null,null,null,0]
[null,"Caserne","Havre","recrutement",8000,32,31,null,null,null,null,8000,null,null,null,null,null,null,null,0]
[null,"Guilde des mages niveau 1","Havre","magie",6300,16,18,null,null,null,null,6300,null,null,null,null,null,null,null,0]
[null,"Guilde des mages niveau 2","Havre","magie",14000,47,48,4,4,4,4,14000,null,null,null,null,null,null,null,0]
[null,"Marché","Inferno","autre",1020,4,4,null,null,null,null,1020,null,null,null,null,null,null,null,0]
[null,"Silo à ressources niveau 1","Nécropole","autre",500,3,2,null,null,null,null,null,null,null,null,null,null,null,null,0]
[null,"Marché","Nécropole","autre",765,5,4,null,null,null,null,null,null,null,null,null,null,null,null,{"$f":"Q202*S202","v":0}]
[null,"Marché","Académie","autre",850,4,5,null,null,null,null,850,null,null,null,null,null,null,null,0]
[null,"Taverne","Sylvan","autre",450,3,3,null,null,null,null,450,null,null,null,null,null,null,null,0]
[null,"Taverne","Inferno","autre",600,3,3,null,null,null,null,600,null,null,null,null,null,null,null,0]
[null,"Marché","Sylvan","autre",765,6,5,null,null,null,null,765,null,null,null,null,null,null,null,0]
[null,"Taverne","Nécropole","autre",450,4,3,null,null,null,null,null,null,null,null,null,null,null,null,0]
[null,"Taverne","Académie","autre",500,3,4,null,null,null,null,500,null,null,null,null,null,null,null,0]
[null,"Taverne","Havre","autre",500,3,4,null,null,null,null,500,null,null,null,null,null,null,null,0]
[null,"Marché","Havre","autre",850,7,5,null,null,null,null,850,null,null,null,null,null,null,null,0]
[null,"Silo à ressources niveau 1","Inferno","autre",500,4,4,null,null,null,null,500,null,null,null,null,null,null,null,0]
[null,"Silo à ressources niveau 1","Académie","autre",500,4,5,null,null,null,null,500,null,null,null,null,null,null,null,0]
[null,"Silo à ressources niveau 1","Havre","autre",500,6,6,null,null,null,null,500,null,null,null,null,null,null,null,0]
[null,"Silo à ressources niveau 1","Sylvan","autre",500,6,6,null,null,null,null,500,null,null,null,null,null,null,null,0]
[null,"Nef céleste","Académie","administration",180000,62,114,null,null,null,null,180000,null,null,null,null,null,null,null,0]
[null,"Sentinelle d'Elrath","Havre","administration",180000,120,113,null,null,null,null,180000,null,null,null,null,null,null,null,0]
[null,"Maitre des supplices","Inferno","administration",216000,99,85,7,null,20,null,216000,null,null,null,null,null,null,null,0]
[null,"Tombeau des maudits","Nécropole","administration",162000,75,69,null,null,null,null,null,null,null,null,null,null,null,null,0]
[null,"Fille de Sylanna","Sylvan","administration",162000,91,105,null,null,null,null,162000,null,null,null,null,null,null,null,0]
[]
[null,null,null,null,null,null,null,null,null,null,null,null,null,null,null,null,null,null,null,{"$f":"SUM(T136:T177)","v":0}]
[]
[]
[]
[]
[]
[]
[]
[]
[]
[]
[]
[null,null,null,{"$f":"18*70","v":1260},{"$f":"10*134","v":1340}]

{"sheet":"Quêtes","index":6,"n_rows":49,"n_cols":23,"rows_kept":49,"cut":false,"hidden":false,"merged":[[1,4,2,4],[1,5,2,5]]}
[null,null,"2010-09-06T22:14:00","Protection débutant",null,"en jaune : ajustements",null,null,"EVOLUTION DU STOCK",null,null,null,null,null,"démarrage le lundi 23"]
[null,null,null,null,"Heure","Temps\n(h)",null,null,null,null,null,null,null,null,87,134,303,751,1430]
[null,null,"Quête",null,null,null,null,null,null,null,null,null,null,null,"T1","T2","T3","T4","T5","Domination"]
[]
[null,1,"Construire un nouveau bâtiment ",null,null,null,800,null,null,null,null,null,null,null,null,null,null,null,null,null,null,null,"Il faut vous construire un autre bâtiment après la taverne pour compléter cette quête"]
[null,2,"Les bâtiments principaux ",null,null,null,1500,null,null,null,null,null,null,null,null,null,null,null,null,null,null,null,"Les trois bâtiments principaux sont la taverne, le marché et l'habitation T1"]
[null,3,"Échanger des ressources",null,null,null,6000,null,null,null,null,null,null,null,null,null,null,null,null,null,null,null,"Il faut échanger un total de 5 000 PO de ressources par l'intermédiaire du marché pour valider la quête"]
[]
[null,1,"Recruter un héros",null,null,null,null,null,null,null,null,null,null,null,null,null,null,null,null,null,null,null,"Il faut recruter un Héros pour compléter cette quête"]
[null,2,"Faire progresser un héros",null,null,null,12000,null,null,null,null,null,null,null,null,null,null,null,null,null,null,null,"Faire progresser un héros jusqu'au niveau 10"]
[null,3,"Victoire écrasante",null,null,null,15000,null,null,null,null,null,null,null,null,null,null,null,null,null,null,null,"Remporter un combat avec une victoire écrasante"]
[]
[null,1,"Libérez les mines",null,null,null,5000,null,null,null,null,null,null,null,null,null,null,null,null,null,null,null,"libérer les 4 mines des PNJ qui l'occupent pour compléter cette quête."]
[null,2,"Conquérir les zones environnantes",null,null,null,4000,null,null,null,null,null,null,null,null,null,null,null,null,null,null,null,"Libérer les cases voisines de votre cité"]
[null,3,"Libérer votre région",null,null,null,20000,null,null,null,null,null,null,null,null,null,null,null,null,null,"cumul",null,"Libérer toute les cases de votre région"]
[null,4,"Améliorer vos mines",null,null,null,7000,null,null,null,null,null,null,null,null,null,null,null,null,null,null,null,"Améliorer vos mines jusqu'au niveau 5 (en amélioration ou perfectionnement)"]
[null,null,null,null,null,null,null,null,null,null,null,null,null,null,null,null,null,null,null,null,null,"Nécropole / Inferno / Havre / Académie / Sylve"]
[null,1,"Bonus de Troupe",null,null,null,null,null,null,null,null,null,null,null,null,6,null,null,null,{"$f":"O18*$O$2+P18*$P$2+Q18*$Q$2+R18*$R$2+S18*$S$2","v":804},{"$f":"T18+U17","v":804},"6 T2 / 4 T2 / 7 T2 / 6 T2","Gagner un combat avec le bonus de roue pour tous ses pelotons"]
[null,2,"Déroulement du combat",null,null,null,null,null,null,null,null,null,null,null,null,7,null,null,null,{"$f":"O19*$O$2+P19*$P$2+Q19*$Q$2+R19*$R$2+S19*$S$2","v":938},{"$f":"T19+U18","v":1742},"7 T2 / 5 T2 / 8 T2 / 6 T2","Organisez votre armée qu'elle comporte au moins 3 pelotons puis engagez le combat."]
[null,3,"Connaitre vos unités",null,null,null,null,null,null,null,null,null,null,null,null,null,4,null,null,1212,2954,"4 T3 / 3 T3 / 4 T3 / 3 T3","Organisez votre armée afin que l'un de vos pelotons gagne un round avec une puissance tout juste suffisante. (10% du pack doit survivre)"]
[null,4,"Balayer ses ennemis",null,null,null,null,null,null,null,null,null,null,null,4,null,3,null,null,1257,4211,"3 T1 - 4 T3 / 3 T1 - 3 T3 / 4 T1 - 4 T3 / 3 T1 - 3 T3","Organisez votre armée afin qu'au moins un de vos pelotons massacre au moins un peloton ennemi. Soyez victorieux."]
[null,5,"Influence des héros ",null,null,null,null,null,null,null,null,null,null,null,7,null,4,null,null,1821,6032,"7 T1 - 4 T3 / 8 T1 - 4 T3 / 7 T1 - 3 T3","Sélectionnez un héros possédant au moins 6 en attaque, une armée, et gagnez le combat."]
[null,6,"Les pertes suite au combat",null,null,null,null,null,null,null,null,null,null,null,null,6,4,null,null,2016,8048,"6 T2 - 4 T3 / 4 T2 - 3 T3 / 7 T2 - 4 T3 / 5 T2 - 3 T3","Organisez votre armée afin qu'au moins un de vos pelotons soit mis en déroute et gagnez le combat."]
[null,7,"Maximisez vos gains en expérience",null,null,null,null,null,null,null,null,null,null,null,null,null,null,3,null,2253,10301,"3 T4 / 3 T4 / 4 T4 / 3 T4","Sélectionnez une case à libérer et obtenez une victoire avec un modificateur d'honneur supérieur ou égal à 30%."]
[null,8,"Caractéristiques des créatures",null,null,null,null,null,null,null,null,null,null,null,null,3,null,3,null,2655,12956,"3 T2 - 3 T4 / 3 T2 - 4 T4 / 2 T2 - 3 T4","Organisez votre armée et tentez d'obtenir une victoire majeure en maximisant votre expérience et en minimisant vos pertes."]
[null,9,"Utilisez la puissance de la magie ",null,null,null,null,null,null,null,null,null,null,null,null,6,null,3,null,3057,16013,"6 T2 - 3 T4 / 7 T2 - 4 T4 / 5 T2 - 3 T4","Sélectionnez un héros avec une caractéristique magie et une carrière magique, garnissez son livre de sorts et faites-lui lancer au moins un sort lors d'un combat victorieux."]
[null,10,"Massacre héroïque",null,null,null,null,null,null,null,null,null,null,null,null,null,4,3,null,3465,19478,"4 T3 - 3 T4 / 4 T3 - 4 T4 / 3 T3 - 3 T4","Sélectionnez un héros possédant une haute valeur d'attaque, et gagnez le combat en réussissant à massacrer un peloton ennemi au moyen d'un peloton du même type."]
[null,11,"Gagner un combat en utilisant un objet magique",null,null,null,null,null,null,null,null,null,null,null,null,null,null,null,4,5720,25198,"4 T5 / 5 T5 / 4 T5","Équipez l'un de vos héros avec un objet offrant un bonus à l'attaque ou aux sorts, sélectionnez une case à libérer et gagnez le combat."]
[null,null,null,null,null,null,null,null,null,null,null,null,null,null,null,null,null,null,null,null,32564]
[null,1,"Contacter vos voisins",null,null,null,8000]
[null,2,"Créer une nouvelle cité",null,null,null,15000,5,5,null,null,null,null,null,null,null,null,null,null,null,null,null,"1. Une case = une quête"]
[]
[null,1,"Palier 2 de domination",null,null,null,null,null,null,null,null,null,null,null,null,null,null,null,5,{"$f":"O33*$O$2+P33*$P$2+Q33*$Q$2+R33*$R$2+S33*$S$2","v":7150},null,null,"Il faut se débrouiller pour associer chaque du secteur proche de la cité avec une quête de la section combat, y compris les mines. Cela est assez simple à faire si vous vous organisez un minimum."]
[null,null,null,null,null,null,null,null,null,null,null,null,null,null,null,null,null,null,null,null,null,null,"Ne pas oublier de réserver une case extérieur pour la quête victoire écrasante qui se fera beaucoup plus tard mais dont la récompense est extrêmement intéressante."]
[]
[null,null,null,null,null,null,null,null,null,null,null,null,null,null,null,null,null,null,null,null,null,null,"http://forums-mightandmagicheroeskingdoms.ubi.com/fr/read.php?61,773251,page=1"]
[]
[]
[null,null,null,null,null,null,null,null,null,null,null,null,null,null,null,null,null,null,null,{"$f":"SUM(T18:T33)","v":32348}]
[]
[null,null,{"$f":"53+30+33","v":116}]
[null,null,{"$f":"C41*70","v":8120}]
[null,null,{"$f":"26+12","v":38},null,null,null,null,null,null,null,null,null,null,null,null,null,null,null,{"$f":"T43*U43","v":4270},70,61]
[null,null,{"$f":"C43*303","v":11514},null,null,null,null,null,null,null,null,null,null,null,null,null,null,null,{"$f":"T44*U44","v":1474},134,11]
[null,null,{"$f":"16+41+8","v":65}]
[null,null,{"$f":"C45*134","v":8710},null,null,null,null,null,null,null,null,null,null,null,null,null,null,null,5600]
[]
[]
[null,null,null,null,null,null,null,null,null,null,null,null,null,null,null,null,null,null,62349]

{"sheet":"Créatures","index":7,"n_rows":110,"n_cols":10,"rows_kept":110,"cut":false,"hidden":false,"merged":[[33,0,33,9]]}
[]
[]
[]
[]
[]
[]
[]
[]
[]
[]
[]
[]
[]
[]
[]
[]
[]
[]
[]
[]
[]
[]
[]
[]
[]
[]
[]
[]
[]
[]
[]
[]
[]
["75 créatures"]
["Nom","Aspect","Arme","Rang","Faction","Puissance","Cout","Amélioration","Rentabilité","Expérience"]
["Élémentaire d'air",null,null,"6+","neutre","4 200",null,null,null,210]
["Élémentaire d'eau",null,null,"6+","neutre","3 900",null,null,null,195]
["Élémentaire de terre",null,null,"6+","neutre","3 600",null,null,null,180]
["Élémentaire de feu",null,null,"6+","neutre","3 300",null,null,null,165]
["Chevalier de la mort",null,null,"9+","neutre","60 000",null,null,null,"3 000,00"]
["Gremlin",null,null,1,"Académie",71,189,56,0.38,4.7300000000000004]
["Ingénieur gremlin",null,null,"1+","Académie",86,226,null,0.38,5.73]
["Gargouille de pierre",null,null,2,"Académie",120,342,102,0.35,8]
["Gargouille d'obsidienne",null,null,"2+","Académie",144,410,null,0.35,9.6]
["Golem de fer",null,null,3,"Académie",272,720,216,0.38,18.13]
["Golem d'acier",null,null,"3+","Académie",327,864,null,0.38,21.8]
["Mage",null,null,4,"Académie",674,"1 584",474,0.43,56.17]
["Archimage",null,null,"4+","Académie",809,"1 900",null,0.43,67.42]
["Djinn",null,null,5,"Académie","1 317","900 2","750 2",0.45,109.75]
["Sultan djinn",null,null,"5+","Académie","1 994","1 400 3",null,0.45,166.17]
["Rani Rakshasa",null,null,6,"Académie","2 242","1 800 3","750 2",0.47,186.83]
["Raja Rakshasa",null,null,"6+","Académie","2 950","2 300 4",null,0.47,245.83]
["Géant",null,null,7,"Académie","5 850",10,6,0.59,585]
["Titan",null,null,"7+","Académie","8 190",14,null,0.59,819]
["Paysan",null,null,1,"Havre",97,220,86,0.44,6.47]
["Conscrit",null,null,"1+","Havre",128,277,null,0.46,8.5299999999999994]
["Archer",null,null,2,"Havre",198,440,171,0.45,13.2]
["Arbalétrier",null,null,"2+","Havre",263,554,null,0.47,17.53]
["Fantassin",null,null,3,"Havre",407,880,264,0.46,27.13]
["Champion",null,null,"3+","Havre",488,"1 056",null,0.46,32.53]
["Griffon",null,null,4,"Havre",751,"1 672",501,0.45,62.58]
["Griffon impérial",null,null,"4+","Havre",902,"2 006",null,0.45,75.17]
["Prêtre",null,null,5,"Havre","1 747","1 200 2","750 2",0.55000000000000004,145.58000000000001]
["Inquisiteur",null,null,"5+","Havre","2 575","1 700 3",null,0.55000000000000004,214.58]
["Cavalier",null,null,6,"Havre","3 188","2 400 3","750 2",0.59,265.67]
["Paladin",null,null,"6+","Havre","4 508","2 900 4",null,0.65,375.67]
["Ange",null,null,7,"Havre","7 150",10,6,0.72,715]
["Archange",null,null,"7+","Havre","10 010",14,null,0.72,"1 001,00"]
["Diablotin",null,null,1,"Inferno",71,189,56,0.38,4.7300000000000004]
["Familier",null,null,"1+","Inferno",86,226,null,0.38,5.73]
["Démon cornu",null,null,2,"Inferno",163,399,119,0.41,10.87]
["Démon gardien",null,null,"2+","Inferno",196,478,null,0.41,13.07]
["Chien des enfers",null,null,3,"Inferno",370,840,252,0.44,24.67]
["Cerbère",null,null,"3+","Inferno",445,"1 008",null,0.44,29.67]
["Succube",null,null,4,"Inferno",918,"1 848",554,0.5,76.5]
["Maitresse succube",null,null,"4+","Inferno","1 101","2 217",null,0.5,91.75]
["Cheval infernal",null,null,5,"Inferno","1 795","1 100 2","900 2",0.57999999999999996,149.58000000000001]
["Destrier de cauchemar",null,null,"5+","Inferno","2 668","1 700 3",null,0.56999999999999995,222.33]
["Fiélon des abimes",null,null,6,"Inferno","2 946","2 200 3","750 2",0.56999999999999995,245.5]
["Seigneur des abimes",null,null,"6+","Inferno","3 816","2 700 4",null,0.56999999999999995,318]
["Diable",null,null,7,"Inferno","6 825",10,6,0.68,682.5]
["Archidiable",null,null,"7+","Inferno","9 555",14,null,0.68,955.5]
["Squelette",null,null,1,"Nécropole",87,209,0,0.42,5.8]
["Archer squelette",null,null,"1+","Nécropole",70,205,null,0.34,4.67]
["Zombie",null,null,2,"Nécropole",134,361,108,0.37,8.93]
["Zombie pestilentiel",null,null,"2+","Nécropole",160,433,null,0.37,10.67]
["Fantôme",null,null,3,"Nécropole",303,760,228,0.4,20.2]
["Spectre",null,null,"3+","Nécropole",364,912,null,0.4,24.27]
["Vampire",null,null,4,"Nécropole",751,"1 672",501,0.45,62.58]
["Seigneur vampire",null,null,"4+","Nécropole",902,"2 006",null,0.45,75.17]
["Liche",null,null,5,"Nécropole","1 430","1 000 2","750 2",0.48,119.17]
["Archiliche",null,null,"5+","Nécropole","2 144","1 500 3",null,0.48,178.67]
["Revenant",null,null,6,"Nécropole","2 578","2 000 3","750 2",0.52,214.83]
["Apparition",null,null,"6+","Nécropole","3 365","2 500 4",null,0.52,280.42]
["Dragon squelette",null,null,7,"Nécropole","5 866",10,6,0.59,586.6]
["Dragon spectral",null,null,"7+","Nécropole","8 213",14,null,0.59,821.3]
["Nymphe",null,null,1,"Sylvan",88,210,63,0.42,5.87]
["Dryade",null,null,"1+","Sylvan",106,252,null,0.42,7.07]
["Fine-lame",null,null,2,"Sylvan",163,399,120,0.41,10.87]
["Lame-de-guerre",null,null,"2+","Sylvan",196,479,null,0.41,13.07]
["Chasseur",null,null,3,"Sylvan",448,924,278,0.48,29.87]
["Maitre chasseur",null,null,"3+","Sylvan",538,"1 109",null,0.49,35.869999999999997]
["Druide",null,null,4,"Sylvan",918,"1 848",555,0.5,76.5]
["Druide séculaire",null,null,"4+","Sylvan","1 101","2 218",null,0.5,91.75]
["Licorne",null,null,5,"Sylvan","1 709","1 100 2","750 2",0.55000000000000004,142.41999999999999]
["Licorne d'argent",null,null,"5+","Sylvan","2 541","1 600 3",null,0.55000000000000004,211.75]
["Tréant",null,null,6,"Sylvan","2 652","2 200 3","750 2",0.51,221]
["Tréant séculaire",null,null,"6+","Sylvan","3 434","2 700 4",null,0.51,286.17]
["Dragon vert",null,null,7,"Sylvan","6 143",10,6,0.61,614.29999999999995]
["Dragon d'émeraude",null,null,"7+","Sylvan","9 077",14,null,0.65,907.7]

{"sheet":"Villes","index":8,"n_rows":107,"n_cols":26,"rows_kept":107,"cut":false,"hidden":false,"merged":[[69,5,69,6],[69,7,69,10],[70,5,70,6],[70,7,70,10],[50,5,50,6],[28,5,28,6],[28,7,28,10],[48,5,48,6],[48,7,48,10],[68,5,68,6],[68,7,68,10],[29,5,29,6],[29,7,29,10],[30,5,30,6],[30,7,30,10],[49,7,49,10],[50,7,50,10],[49,5,49,6],[87,5,87,6],[87,7,87,10],[88,5,88,6],[88,7,88,10],[89,5,89,6],[89,7,89,10]]}
[null,null,null,null,null,null,null,null,null,"5 villes = DOM !"]
[null,null,null,"Date actuelle","2010-09-29T21:30:11.420",null,null,null,null,null,null,"2010-10-01T18:21:10.562",null,null,null,null,null,null,null,null,"Le ratio est plus intéressant pour les Ateliers niv.1 dès que le niv 6 de mine est atteint"]
[null,null,null,"Richesse actuelle",2107251,null,"marchand",0.18,null,null,"UP","2010-10-01T18:12:14.936"]
[null,null,null,"Palier",2560000,null,"Tréso des nains",1,null,null,null,null,null,null,null,null,null,null,null,"Rapporte","Cout total","Ratio",null,"Temps passé"]
[null,null,null,"Passage de palier",{"$f":"((E4-E3)/E10)+E2","v":"2010-10-01T18:44:42.300"},null,null,null,null,null,null,{"$f":"(L2-L3)*24*60","v":8.92709547188133},null,null,null,null,null,null,null,null,null,"gain/cout"]
[null,null,null,null,null,null,null,null,null,null,null,null,null,null,"gain T/palier (mn)"]
[]
[]
[null,null,null,"Production totale",{"$f":"E15+E35+E56","v":100044.00000000001},53.461000000000006,53.314000000000007,9.3280000000000012,0,7.3500000000000005,0,null,null,"1 niveau com/rare v1",24,34000,null,null,null,null,{"$f":"P9+Q9*500+R9*500+S9*1000","v":34000},{"$f":"O9/U9*10000","v":7.0588235294117654}]
[null,null,null,"Richesse quotidienne",{"$f":"E9+F9*1000+G9*1000+H9*2000+I9*2000+J9*2000+K9*2000+H10","v":240175.00000000003},null,"Combats",null,null,null,null,null,null,"1 niveau or v1",25,34000,null,null,null,null,34000,{"$f":"O10/U10*10000","v":7.3529411764705879}]
[null,null,null,"Revenus quotidiens",{"$f":"E9+((F9+G9)*500+(H9+I9+J9+K9)*1000)*(1+H3)","v":182721.29},null,null,null,null,null,null,null,null,"1 niveau or v2",28.24,34000,null,null,null,null,34000,{"$f":"O11/U11*10000","v":8.3058823529411754}]
[null,null,null,null,null,null,null,null,null,null,null,null,null,"Conseil du village","N/A",null,null,null,null,2000,0]
[null,"Ville 1","Kazimodhal",null,null,null,null,null,null,null,null,null,null,"Mairie","N/A",null,null,null,null,4000,0]
[null,null,null,null,null,null,null,null,null,null,null,null,null,"Hôtel de ville",39.437320015858802,19800,40,31,null,7000,{"$f":"P14+Q14*500+R14*500+S14*1000","v":55300},{"$f":"O14/U14*10000","v":7.1315226068460769}]
[null,null,null,null,{"$f":"(E19+E23+E16)*(1+E30*E31)*(1+0.05*$H$4)","v":24990},{"$f":"F19*(1+F30*F31+F28)","v":18.312000000000001},{"$f":"G19*(1+F30*F31+G28)","v":18.312000000000001},{"$f":"H19*(1+H30*H31+H28)","v":0},{"$f":"I19*(1+H30*H31+I28)","v":0},{"$f":"J19*(1+H30*H31+J28)","v":7.3500000000000005},{"$f":"K19*(1+H30*H31+K28)","v":0},null,null,"Capitole","N/A",108000,105,61,null,13000,{"$f":"P15+Q15*500+R15*500+S15*1000","v":191000}]
[null,null,null,"Hotel de ville",7000,null,null,null,null,null,null,null,null,"Atelier minerai niv 1 v1",9.0836248209234327,3000,null,2,null,null,4000,{"$f":"O16/U16*10000","v":22.709062052308578}]
[null,null,null,"Mine niveau",8,8,8,null,null,7,null,null,null,"Atelier rare niv 1 v1",8.92709547188133,3000,null,null,1,null,4000,{"$f":"O17/U17*10000","v":22.317738679703325}]
[null,null,null,"Perfectionnée de",0.05,0.05,0.05,null,null,0.05,null,null,null,"Atelier bois niv 1 v1",9.0836248209234327,3000,2,null,null,null,4000,{"$f":"O18/U18*10000","v":22.709062052308578}]
[null,null,null,"Production brute",{"$f":"E17*2000*(E18+1)","v":16800},{"$f":"F17*2*(F18+1)","v":16.8},{"$f":"G17*2*(G18+1)","v":16.8},{"$f":"H17*(H18+1)","v":0},{"$f":"I17*(I18+1)","v":0},{"$f":"J17*(J18+1)","v":7.3500000000000005},{"$f":"K17*(K18+1)","v":0},null,null,"Atelier minerai niv 1 v2",null,3000,null,2,null,null,4000,{"$f":"O19/U19*10000","v":0}]
[null,null,null,"Total mine",{"$f":"E19*(1+E30*E31+$H$4)","v":33600},{"$f":"F19*(1+F30*F31+$H$4)","v":35.112000000000002},{"$f":"G19*(1+F30*F31+$H$4)","v":35.112000000000002},{"$f":"H19*(1+H30*H31+$H$4)","v":0},{"$f":"I19*(1+H30*H31+$H$4)","v":0},{"$f":"J19*(1+H30*H31+$H$4)","v":14.700000000000001},{"$f":"K19*(1+H30*H31+$H$4)","v":0}]
[null,null,null,"Mine niveau",null,null,null,null,null,null,null,null,null,"3% chercheur or v2",16.201764971483499]
[null,null,null,"Perfectionnée de",null,null,null,null,null,null,null,null,null,"3% chercheur or v1",8.5,null,null,null,null,null,null,null,"Kaztor",null,"1 X Atelier"]
[null,null,null,"Production brute",{"$f":"E21*2000*(E22+1)","v":0},{"$f":"F21*2*(F22+1)","v":0},{"$f":"G21*2*(G22+1)","v":0},{"$f":"H21*(H22+1)","v":0},{"$f":"I21*(I22+1)","v":0},{"$f":"J21*(J22+1)","v":0},{"$f":"K21*(K22+1)","v":0},null,null,"3% d'intendant v1",9.5]
[null,null,null,"Total mine",{"$f":"E23*(1+E34*E35+$H$4)","v":0},{"$f":"F23*(1+F34*F35+$H$4)","v":0},{"$f":"G23*(1+F34*F35+$H$4)","v":0},{"$f":"H23*(1+H34*H35+$H$4)","v":0},{"$f":"I23*(1+H34*H35+$H$4)","v":0},{"$f":"J23*(1+H34*H35+$H$4)","v":0},{"$f":"K23*(1+H34*H35+$H$4)","v":0},null,null,null,null,null,null,null,null,null,null,null,"Kazimodho >>","Kazimodal","3 x Atelier"]
[null,null,null,null,null,null,null,null,null,null,null,null,"Cout des villes",null,null,null,null,null,null,null,null,null,"Patrifia Kaz >> Mine L9"]
[null,null,null,"Atelier niveau",null,0,0,null,0,0,null,null,"v2 = 20k or 20/20 mine bois",null,null,null,null,null,null,null,"ou équivalent avec prise de territoire",null,"Kazablanca >>",null,"Guilde mages"]
[null,null,null,"Bonus de mine proche",null,0.2,0.2,null,null,0.2,null,null,"v3 = 50k or 50/50 mine bois"]
[null,null,null,"Bonus brut",null,{"$f":"4*F26%*(1+F27)","v":0},{"$f":"4*G26%*(1+G27)","v":0},{"$f":"4*H26%*(1+H27)","v":0},0,0,0,null,"v4 = 90k or 90/90 mine bois",null,null,null,null,null,53.15,"76,20",null,null,"Kazinière >> Kazablanca >> Combats",null,"Combat E2"]
[null,null,null,null,"Chercheur d'or","Intendant",null,"Alchimiste",null,null,null,null,null,null,null,null,null,null,null,61.32,null,null,"Kaztor >> Troupes >> Combat",null,"Combat B4"]
[null,null,null,"Héros bâtisseur ",0,0.09,null,0,null,null,null,null,"v5 =140k or 140/140 mine bois",null,null,null,null,4.2,4,4,null,null,null,null,"Combat D5"]
[null,null,null,"Héros présent / absent",0,1,null,0,null,null,null,null,"v6 = 200 k or et 200 / 200 minerai / bois ?",null,null,null,null,"1xOr","2xOr","1xOr",null,null,"Kaztor >> Ateliers"]
[null,null,null,null,null,null,null,null,null,null,null,null,"v7 = 270 k or et 270 / 270 minerai / bois ?",null,null,null,null,"2xBois","1xBois","1xBois",null,null,"Azcran >> Kazablanca >> Mine L9"]
[null,"Ville 2","Kazbaaah",null,null,null,null,null,null,null,null,null,"v8 = 350k or et 350 / 350 minerai / bois",null,null,null,null,"1xMine","1xMine","1xMine"]
[null,null,null,null,null,null,null,null,null,null,null,null,"v9 = 440 k or et 440 / 440 minerai / bois ?",null,null,null,null,null,null,"1xMerc"]
[null,null,null,null,{"$f":"(E39+E43+E36)*(1+E50*E51)*(1+0.05*$H$4)","v":49417.200000000004},{"$f":"F39*(1+F50*F51+F48)","v":17.600000000000001},{"$f":"G39*(1+F50*F51+G48)","v":17.600000000000001},{"$f":"H39*(1+H50*H51+H48)","v":0},{"$f":"I39*(1+H50*H51+I48)","v":0},{"$f":"J39*(1+H50*H51+J48)","v":0},{"$f":"K39*(1+H50*H51+K48)","v":0},null,null,null,null,null,"Cout de l'installation ?"]
[null,null,null,"Hotel de ville",7000,null,null,null,null,null,null,null,"[(n×(n+1)/2)-1] × (10 000 or + 10 bois + 10 minerai)"]
[null,null,null,"Mine niveau",9,8,8,null,null,null,null,null,"Avec n = nombre de cités après fondation"]
[null,null,null,"Perfectionnée de",0.1,0.1,0.1,null,null,null,null,null,null,null,null,"Meilleure prochaine ville ?"]
[null,null,null,"Production brute",{"$f":"E37*2000*(E38+1)","v":19800},{"$f":"F37*2*(F38+1)","v":17.600000000000001},{"$f":"G37*2*(G38+1)","v":17.600000000000001},{"$f":"H37*(H38+1)","v":0},{"$f":"I37*(I38+1)","v":0},{"$f":"J37*(J38+1)","v":0},{"$f":"K37*(K38+1)","v":0}]
[null,null,null,"Total mine",{"$f":"E39*(1+E50*E51+$H$4)","v":40788},{"$f":"F39*(1+F50*F51+$H$4)","v":35.200000000000003},{"$f":"G39*(1+F50*F51+$H$4)","v":35.200000000000003},{"$f":"H39*(1+H50*H51+$H$4)","v":0},{"$f":"I39*(1+H50*H51+$H$4)","v":0},{"$f":"J39*(1+H50*H51+$H$4)","v":0},{"$f":"K39*(1+H50*H51+$H$4)","v":0}]
[null,null,null,"Mine niveau",8,null,null,null,null,null,null,null,"Or1","Or2","Bois1","Bois2","Mine1","Merc","N","o1","o2","b1","b2","m1","me1","total"]
[null,null,null,"Perfectionnée de",0.1,null,null,null,null,null,null,null,1,1,1,1,1,1,6,1,0.8,1.2,1,1,0.5,5.5]
[null,null,null,"Production brute",{"$f":"E41*2000*(E42+1)","v":17600},{"$f":"F41*2*(F42+1)","v":0},{"$f":"G41*2*(G42+1)","v":0},{"$f":"H41*(H42+1)","v":0},{"$f":"I41*(I42+1)","v":0},{"$f":"J41*(J42+1)","v":0},{"$f":"K41*(K42+1)","v":0},null,1,1,1,1,1,0,5,1,0.8,1.2,1,1,0,5]
[null,null,null,"Total mine",{"$f":"E43*(1+E50*E51+$H$4)","v":36256},{"$f":"F43*(1+F50*F51+$H$4)","v":0},{"$f":"G43*(1+F50*F51+$H$4)","v":0},{"$f":"H43*(1+H50*H51+$H$4)","v":0},{"$f":"I43*(1+H50*H51+$H$4)","v":0},{"$f":"J43*(1+H50*H51+$H$4)","v":0},{"$f":"K43*(1+H50*H51+$H$4)","v":0}]
[null,null,null,null,null,null,null,null,null,null,null,null,1,0,1,1,1,1,5,1,0,1.2,1,1,0.5,4.7]
[null,null,null,"Atelier niveau",null,0,null,null,null,null,null,null,0,1,1,1,1,1,5,0,1,1.2,1,1,0.5,4.7]
[null,null,null,"Bonus de mine proche",null,0,null,null,null,null,null,null,1,1,1,0,1,1,5,1,0.8,1.2,0,1,0.5,4.5]
[null,null,null,"Bonus brut",null,{"$f":"4*F46%*(1+F47)","v":0},{"$f":"4*G46%*(1+G47)","v":0},{"$f":"4*H46%*(1+H47)","v":0},0,0,0,null,1,1,1,1,0,1,5,1,0.8,1.2,1,0,0.5,4.5]
[null,null,null,null,"Chercheur d'or","Intendant",null,"Alchimiste",null,null,null,null,1,1,0,1,1,1,5,1,0.8,0,1.2,1,0.5,4.5]
[null,null,null,"Héros bâtisseur",0.06,0.09,null,0,null,null,null,null,1,0,1,1,1,0,4,1,0,1.2,1,1,0,4.2]
[null,null,null,"Héros présent / absent",1,0,null,0,null,null,null,null,0,1,1,1,1,0,4,0,1,1.2,1,1,0,4.2]
[null,null,null,null,null,null,null,null,null,null,null,null,1,1,1,0,1,0,4,1,0.8,1.2,0,1,0,4]
[null,null,null,null,null,null,null,null,null,null,null,null,1,1,1,1,0,0,4,1,0.8,1.2,1,0,0,4]
[null,"Ville 3","Kazablanca",null,null,null,null,null,null,null,null,null,1,1,0,1,1,0,4,1,0.8,0,1.2,1,0,4]
[null,null,null,null,null,null,null,null,null,null,null,null,1,0,1,0,1,1,4,1,0,1.2,0,1,0.5,3.7]
[null,null,null,null,{"$f":"(E60+E64+E57)*(1+E70*E71)*(1+0.05*$H$4)","v":25636.799999999999},{"$f":"F60*(1+F70*F71+F68)","v":17.548999999999999},{"$f":"G60*(1+F70*F71+G68)","v":17.402000000000005},{"$f":"H60*(1+H70*H71+H68)","v":9.3280000000000012},{"$f":"I60*(1+H70*H71+I68)","v":0},{"$f":"J60*(1+H70*H71+J68)","v":0},{"$f":"K60*(1+H70*H71+K68)","v":0},null,0,0,1,1,1,1,4,0,0,1.2,1,1,0.5,3.7]
[null,null,null,"Mairie",4000,null,null,null,null,null,null,null,1,0,1,1,0,1,4,1,0,1.2,1,0,0.5,3.7]
[null,null,null,"Mine niveau",8,7,7,8,null,null,null,null,1,0,0,1,1,1,4,1,0,0,1.2,1,0.5,3.7]
[null,null,null,"Perfectionnée de",0.15,0.15,0.1,0.1,null,null,null,null,0,1,1,0,1,1,4,0,1,1.2,0,1,0.5,3.7]
[null,null,null,"Production brute",{"$f":"E58*2000*(E59+1)","v":18400},{"$f":"F58*2*(F59+1)","v":16.099999999999998},{"$f":"G58*2*(G59+1)","v":15.400000000000002},{"$f":"H58*(H59+1)","v":8.8000000000000007},{"$f":"I58*(I59+1)","v":0},{"$f":"J58*(J59+1)","v":0},{"$f":"K58*(K59+1)","v":0},null,0,1,1,1,0,1,4,0,1,1.2,1,0,0.5,3.7]
[null,null,null,"Total mine",{"$f":"E60*(1+E70*E71+$H$4)","v":38456},{"$f":"F60*(1+F70*F71+$H$4)","v":33.648999999999994},{"$f":"G60*(1+F70*F71+$H$4)","v":32.186},{"$f":"H60*(1+H70*H71+$H$4)","v":18.128000000000004},{"$f":"I60*(1+H70*H71+$H$4)","v":0},{"$f":"J60*(1+H70*H71+$H$4)","v":0},{"$f":"K60*(1+H70*H71+$H$4)","v":0}]
[null,null,null,"Mine niveau",null,null,null,null,null,null,null,null,0,1,0,1,1,1,4,0,1,0,1.2,1,0.5,3.7]
[null,null,null,"Perfectionnée de",null,null,null,null,null,null,null,null,1,1,1,0,0,1,4,1,0.8,1.2,0,0,0.5,3.5]
[null,null,null,"Production brute",{"$f":"E62*2000*(E63+1)","v":0},{"$f":"F62*2*(F63+1)","v":0},{"$f":"G62*2*(G63+1)","v":0},{"$f":"H62*(H63+1)","v":0},{"$f":"I62*(I63+1)","v":0},{"$f":"J62*(J63+1)","v":0},{"$f":"K62*(K63+1)","v":0},null,1,1,0,1,0,1,4,1,0.8,0,1.2,0,0.5,3.5]
[null,null,null,"Total mine",{"$f":"E64*(1+E71*E72+$H$4)","v":0},{"$f":"F64*(1+F71*F72+$H$4)","v":0},{"$f":"G64*(1+F71*F72+$H$4)","v":0},{"$f":"H64*(1+H71*H72+$H$4)","v":0},{"$f":"I64*(1+H71*H72+$H$4)","v":0},{"$f":"J64*(1+H71*H72+$H$4)","v":0},{"$f":"K64*(1+H71*H72+$H$4)","v":0},null,1,1,0,0,1,1,4,1,0.8,0,0,1,0.5,3.3]
[null,null,null,"Atelier niveau",null,0,1,null,null,null,null,null,1,0,1,0,1,0,3,1,0,1.2,0,1,0,3.2]
[null,null,null,"Bonus de mine proche",null,0.2,0,null,null,null,null,null,0,0,1,1,1,0,3,0,0,1.2,1,1,0,3.2]
[null,null,null,"Bonus brut",null,{"$f":"4*F66%*(1+F67)","v":0},{"$f":"4*G66%*(1+G67)","v":0.04},{"$f":"4*H66%*(1+H67)","v":0},0,0,0,null,1,0,1,1,0,0,3,1,0,1.2,1,0,0,3.2]
[null,null,null,null,"Chercheur d'or","Intendant",null,"Alchimiste",null,null,null,null,1,0,0,1,1,0,3,1,0,0,1.2,1,0,3.2]
[null,null,null,"Héros bâtisseur",0.09,0.09,null,0.06,null,null,null,null,0,1,1,0,1,0,3,0,1,1.2,0,1,0,3.2]
[null,null,null,"Héros présent / absent",1,1,null,1,null,null,null,null,0,1,1,1,0,0,3,0,1,1.2,1,0,0,3.2]
[null,null,null,null,null,null,null,null,null,null,null,null,0,1,0,1,1,0,3,0,1,0,1.2,1,0,3.2]
[null,"Ville 4",null,null,null,null,null,null,null,null,null,null,1,1,1,0,0,0,3,1,0.8,1.2,0,0,0,3]
[null,null,null,null,null,null,null,null,null,null,null,null,1,1,0,1,0,0,3,1,0.8,0,1.2,0,0,3]
[null,null,null,"Production totale",{"$f":"(E79+E83+E76)*(1+E89*E90)*(1+0.05*$H$4)","v":0},{"$f":"F79*(1+F89*F90+F87)","v":0},{"$f":"G79*(1+F89*F90+G87)","v":0},{"$f":"H79*(1+H89*H90+H87)","v":0},{"$f":"I79*(1+H89*H90+I87)","v":0},{"$f":"J79*(1+H89*H90+J87)","v":0},{"$f":"K79*(1+H89*H90+K87)","v":0},null,1,1,0,0,1,0,3,1,0.8,0,0,1,0,2.8]
[null,null,null,"Mairie",0,null,"Richesse quotidienne",{"$f":"E94+F94*1000+G94*1000+H94*2000+I94*2000+J94*2000+K94*2000","v":0},null,"Revenus quotidiens",{"$f":"E94+((F94+G94)*500+(H94+I94+J94+K94)*1000)*(1+H88)","v":{"$error":"#VALUE!"}},null,0,0,1,0,1,1,3,0,0,1.2,0,1,0.5,2.7]
[null,null,null,"Mine niveau",0,0,0,0,null,null,null,null,1,0,1,0,0,1,3,1,0,1.2,0,0,0.5,2.7]
[null,null,null,"Perfectionnée de",0.15,0.15,0.1,0.1,null,null,null,null,0,0,1,1,0,1,3,0,0,1.2,1,0,0.5,2.7]
[null,null,null,"Production brute",{"$f":"E77*2000*(E78+1)","v":0},{"$f":"F77*2*(F78+1)","v":0},{"$f":"G77*2*(G78+1)","v":0},{"$f":"H77*(H78+1)","v":0},{"$f":"I77*(I78+1)","v":0},{"$f":"J77*(J78+1)","v":0},{"$f":"K77*(K78+1)","v":0},null,0,0,0,1,1,1,3,0,0,0,1.2,1,0.5,2.7]
[null,null,null,"Total mine",{"$f":"E79*(1+E89*E90+$H$4)","v":0},{"$f":"F79*(1+F89*F90+$H$4)","v":0},{"$f":"G79*(1+F89*F90+$H$4)","v":0},{"$f":"H79*(1+H89*H90+$H$4)","v":0},{"$f":"I79*(1+H89*H90+$H$4)","v":0},{"$f":"J79*(1+H89*H90+$H$4)","v":0},{"$f":"K79*(1+H89*H90+$H$4)","v":0},null,1,0,0,1,0,1,3,1,0,0,1.2,0,0.5,2.7]
[null,null,null,"Mine niveau",null,null,null,null,null,null,null,null,0,1,1,0,0,1,3,0,1,1.2,0,0,0.5,2.7]
[null,null,null,"Perfectionnée de",null,null,null,null,null,null,null,null,0,1,0,1,0,1,3,0,1,0,1.2,0,0.5,2.7]
[null,null,null,"Production brute",{"$f":"E81*2000*(E82+1)","v":0},{"$f":"F81*2*(F82+1)","v":0},{"$f":"G81*2*(G82+1)","v":0},{"$f":"H81*(H82+1)","v":0},{"$f":"I81*(I82+1)","v":0},{"$f":"J81*(J82+1)","v":0},{"$f":"K81*(K82+1)","v":0},null,1,0,0,0,1,1,3,1,0,0,0,1,0.5,2.5]
[null,null,null,"Total mine",{"$f":"E83*(1+E94*H76+$H$4)","v":0},{"$f":"F83*(1+F94*F95+$H$4)","v":0},{"$f":"G83*(1+F94*F95+$H$4)","v":0},{"$f":"H83*(1+H94*H95+$H$4)","v":0},{"$f":"I83*(1+H94*H95+$H$4)","v":0},{"$f":"J83*(1+H94*H95+$H$4)","v":0},{"$f":"K83*(1+H94*H95+$H$4)","v":0},null,0,1,0,0,1,1,3,0,1,0,0,1,0.5,2.5]
[null,null,null,"Atelier niveau",null,null,null,null,null,null,null,null,1,1,0,0,0,1,3,1,0.8,0,0,0,0.5,2.2999999999999998]
[null,null,null,"Bonus de mine proche",null,null,null,null,null,null,null,null,0,0,1,0,1,0,2,0,0,1.2,0,1,0,2.2000000000000002]
[null,null,null,"Bonus brut",null,null,null,null,null,null,null,null,1,0,1,0,0,0,2,1,0,1.2,0,0,0,2.2000000000000002]
[null,null,null,null,"Chercheur d'or","Intendant",null,"Alchimiste",null,null,null,null,0,0,1,1,0,0,2,0,0,1.2,1,0,0,2.2000000000000002]
[null,null,null,"Héros bâtisseur",0.09,0.09,null,0.03,null,null,null,null,0,0,0,1,1,0,2,0,0,0,1.2,1,0,2.2000000000000002]
[null,null,null,"Héros présent / absent",1,1,null,1,null,null,null,null,1,0,0,1,0,0,2,1,0,0,1.2,0,0,2.2000000000000002]
[null,null,null,null,null,null,null,null,null,null,null,null,0,1,1,0,0,0,2,0,1,1.2,0,0,0,2.2000000000000002]
[null,null,null,null,null,null,null,null,null,null,null,null,0,1,0,1,0,0,2,0,1,0,1.2,0,0,2.2000000000000002]
[null,null,null,null,null,null,null,null,null,null,null,null,1,0,0,0,1,0,2,1,0,0,0,1,0,2]
[null,null,null,"Production totale",{"$f":"E100+E120+E141","v":0},null,null,null,null,null,null,null,0,1,0,0,1,0,2,0,1,0,0,1,0,2]
[null,null,null,null,null,null,null,null,null,null,null,null,1,1,0,0,0,0,2,1,0.8,0,0,0,0,1.8]
[null,null,null,null,null,null,null,null,null,null,null,null,0,0,1,0,0,1,2,0,0,1.2,0,0,0.5,1.7]
[null,null,null,null,null,null,null,null,null,null,null,null,0,0,0,1,0,1,2,0,0,0,1.2,0,0.5,1.7]
[null,null,null,null,null,null,null,null,null,null,null,null,0,0,0,0,1,1,2,0,0,0,0,1,0.5,1.5]
[null,null,null,null,null,null,null,null,null,null,null,null,1,0,0,0,0,1,2,1,0,0,0,0,0.5,1.5]
[null,null,null,null,null,null,null,null,null,null,null,null,0,1,0,0,0,1,2,0,1,0,0,0,0.5,1.5]
[null,null,null,null,null,null,null,null,null,null,null,null,0,0,1,0,0,0,1,0,0,1.2,0,0,0,1.2]
[null,null,null,null,null,null,null,null,null,null,null,null,0,0,0,1,0,0,1,0,0,0,1.2,0,0,1.2]
[null,null,null,null,null,null,null,null,null,null,null,null,0,0,0,0,1,0,1,0,0,0,0,1,0,1]
[null,null,null,null,null,null,null,null,null,null,null,null,1,0,0,0,0,0,1,1,0,0,0,0,0,1]
[null,null,null,null,null,null,null,null,null,null,null,null,0,1,0,0,0,0,1,0,1,0,0,0,0,1]
[null,null,null,null,null,null,null,null,null,null,null,null,0,0,0,0,0,1,1,0,0,0,0,0,0.5,0.5]
[null,null,null,null,null,null,null,null,null,null,null,null,0,0,0,0,0,0,0,0,0,0,0,0,0,0]

{"sheet":"récompenses","index":9,"n_rows":34,"n_cols":8,"rows_kept":34,"cut":false,"hidden":false,"merged":[]}
[]
[]
[]
[]
[null,null,null,null,null,null,null,"1 1 000 1 1 918"]
[null,null,null,null,null,null,null,"2 1 000 1 1 918"]
[null,null,null,null,null,null,null,"3 1 500 2 2 1 377"]
[null,null,null,null,null,null,null,"4 2 000 2 2 1 836"]
[null,null,null,null,null,null,null,"5 2 500 3 3 2 295"]
[null,null,null,null,null,null,null,"6 3 000 3 3 2 754"]
[null,null,null,null,null,null,null,"7 3 500 4 4 3 213"]
[null,null,null,null,null,null,null,"8 4 000 4 4 3 672"]
[null,null,null,null,null,null,null,"9 4 500 5 5 4 131"]
[null,null,null,null,null,null,null,"10 5 000 5 5 4 590"]
[null,null,null,null,null,null,null,"11 5 500 6 6 5 049"]
[null,null,null,null,null,null,null,"12 6 000 6 6 5 508"]
[null,null,null,null,null,null,null,"13 6 500 7 7 5 967"]
[null,null,null,null,null,null,null,"14 7 000 7 7 6 426"]
[null,null,null,null,null,null,null,"15 7 500 8 8 6 885"]
[null,null,null,null,null,null,null,"16 8 000 8 8 7 344"]
[null,null,null,null,null,null,null,"17 8 500 9 9 7 803"]
[null,null,null,null,null,null,null,"18 9 000 9 9 8 262"]
[null,null,null,null,null,null,null,"19 9 500 10 10 8 721"]
[null,null,null,null,null,null,null,"20 10 000 10 10 9 180"]
[null,null,null,null,null,null,null,"21 10 500 11 11 9 639"]
[null,null,null,null,null,null,null,"22 11 000 11 11 10 098"]
[null,null,null,null,null,null,null,"23 11 500 12 12 10 557"]
[null,null,null,null,null,null,null,"24 12 000 12 12 11 016"]
[null,null,null,null,null,null,null,"25 12 500 13 13 11 475"]
[null,null,null,null,null,null,null,"26 13 000 13 13 11 934"]
[null,null,null,null,null,null,null,"27 13 500 14 14 12 393"]
[null,null,null,null,null,null,null,"28 14 000 14 14 12 852"]
[null,null,null,null,null,null,null,"29 14 500 15 15 13 311"]
[null,null,null,null,null,null,null,"30 15 000 15 15 13 770"]

{"sheet":"Carte","index":10,"n_rows":25,"n_cols":23,"rows_kept":25,"cut":false,"hidden":false,"merged":[]}
[]
[4,null,null,null,"1. Vent du nord",{"$f":"R4","v":215},{"$f":"S4","v":108},null,null,null,null,null,null,null,{"$f":"150-O14","v":125},{"$f":"150-P14","v":115}]
[3,null,null,null,"2. Freelancer",{"$f":"R5","v":179},257,null,null,null,null,null,null,"X0","X1","Y0",null,"X2","Y2"]
[null,null,null,null,"3. Les Exilés",176,149,null,null,null,null,null,"1. Vent du nord",40,{"$f":"300-N4","v":260},77,null,{"$f":"300-IF(O4+O$2>300,O4+O$2-300,O4+O$2)","v":215},{"$f":"300-IF(P4+P$2>300,P4+P$2-300,P4+P$2)","v":108},null,null,40,77]
[null,null,null,null,"4. La Garde de glace",223,218,null,null,null,null,null,"2. Freelancer",4,296,228,null,179,257,null,null,4,228]
[null,null,null,null,"5. Antre des Héros",142,126,null,null,null,null,null,"3. Exilés",1,299,36,null,176,149,null,null,1,36]
[null,null,null,null,"6. La garde d'argent",211,223,null,null,null,null,null,"4. La Garde de glace",48,252,267,null,223,218,null,null,48,267]
[null,null,null,null,"7. Le Chant des Justes",222,213,null,null,null,null,null,"5. Antre des Héros",267,33,59,null,142,126,null,null,267,59]
[null,null,null,null,"8. Origine online ",261,25,null,null,null,null,null,"6. La garde d'argent",36,264,262,null,211,223,null,null,36,262]
[null,null,null,null,"9. Les Lames d Urgash",106,249,null,null,null,null,null,"7. Le Chant des Justes",47,253,272,null,222,213,null,null,47,272]
[null,null,null,null,"10. Hypérion",141,213,null,null,null,null,null,"8. Origine online ",86,214,160,null,261,25,null,null,86,160]
[null,null,null,null,"11. Djinns Tonic",150,150,null,null,null,null,null,"9. Les Lames d Urgash",231,69,236,null,106,249,null,null,231,236]
[null,null,null,null,"12. Millenium",200,32,null,null,null,null,null,"10. Hypérion",266,34,272,null,141,213,null,null,266,272]
[null,null,null,null,"13. Eternel Espoir",66,215,null,null,null,null,null,"11. Djinns Tonic",275,25,35,null,{"$f":"300-IF(O14+O$2>300,O14+O$2-300,O14+O$2)","v":150},{"$f":"300-IF(P14+P$2>300,P14+P$2-300,P14+P$2)","v":150},null,null,275,35]
[null,null,null,null,"14. Pacte d Enroth",21,86,null,null,null,null,null,"12. Millenium",25,275,153,null,{"$f":"300-IF(O15+O$2>300,O15+O$2-300,O15+O$2)","v":200},{"$f":"300-IF(P15+P$2>300,P15+P$2-300,P15+P$2)","v":32},null,null,25,153]
[null,null,null,null,"15. Chevaliers d Enroth",36,101,null,null,null,null,null,"13. Eternel Espoir",191,109,270,null,66,215,null,null,191,270]
[null,null,null,null,"16. Heritage du dragon",57,5,null,null,null,null,null,"14. Pacte d Enroth",146,154,99,null,21,86,null,null,146,99]
[null,null,null,null,"17. RoXXe",83,253,null,null,null,null,null,"15. Chevaliers d Enroth",161,139,84,null,36,101,null,null,161,84]
[null,null,null,null,"18. Origine",277,39,null,null,null,null,null,"16. Heritage du dragon",182,118,180,null,57,5,null,null,182,180]
[null,null,null,null,"La Garde d'Argent",211,223,null,null,null,null,null,"17. RoXXe",208,92,232,null,83,253,null,null,208,232]
[null,null,null,null,"La Confrérie",107,17,null,null,null,null,null,"18. Origine",102,198,146,null,277,39,null,null,102,146]
[null,null,null,null,null,null,null,null,null,null,null,null,"La Garde d'Argent",36,264,262,null,211,223]
[null,null,null,null,null,null,null,null,null,null,null,null,"La Confrérie",232,68,168,null,107,17]
[null,null,null,null,null,null,null,null,null,null,null,null,"Le chant des anges",251,49,22,null,126,163]
[null,null,null,null,"Le Chant Des Anges",null,null,null,null,null,null,null,"Heritage du dragon",182,118,180,null,57,5]

{"sheet":"Honneur-début","index":11,"n_rows":113,"n_cols":19,"rows_kept":113,"cut":false,"hidden":false,"merged":[]}
[]
[null,null,null,null,null,null,"Dom","Rich","Honneur","cités"]
[null,null,null,null,null,null,11,6,1,2,null,"inferno"]
[null,"Hylian, tybz, Vigne, Valouf et Tharkùn.",null,null,null,null,99,5,2,2,null,"inferno"]
[null,null,null,null,null,null,79,15,3,2,null,"elfe"]
[null,"Kaz'",null,null,null,null,20,8,4,2,null,"mage"]
[null,null,null,null,null,null,124,4,5,2,null,"necro",null,null,null,null,null,null,"ils fe combattent entre eux ?"]
[null,null,null,null,null,null,105,11,6,2,null,"necro",null,null,null,null,null,null,"Voir le profil à BenderZ 22:13 pas possible encore ;-)"]
[null,null,null,null,null,null,7,22,7,2,null,"inferno",null,null,null,null,null,null,"Voir le profil à BenderZ 22:14 pour la dom ça peut s'expliquer simplement par recrutement quotidien"]
[null,null,null,null,null,null,119,71,8,1,null,"inferno",null,null,null,null,null,null,"Voir le profil à BenderZ 22:14 + une politique exclusive de recrutement"]
[null,null,null,null,null,null,75,2,10,2,null,"havre",null,null,null,null,null,null,"Voir le profil à BenderZ 22:14 pour l'honneur...de la chance et des sacrifices"]
[null,null,null,null,null,null,null,null,null,null,null,null,null,null,null,null,null,null,"Voir le profil à BenderZ 22:15 tout dépend des pnj"]
[null,null,null,null,null,null,null,null,null,null,null,null,null,null,null,null,null,null,"Voir le profil à BenderZ 22:17 en plus y a pas mal de no life dans les toplist"]
[null,"Tharkùn ",null,null,null,null,null,null,null,null,null,null,null,null,null,null,null,null,"Voir le profil à BenderZ 22:19 par exemple gnous est 24h devant l'écran ou presque...il est presque toujours toptop dans le classemnt dom et honneur"]
[null,null,null,null,null,null,null,null,null,null,null,null,"La richesse y'a pas de secrets non plus hein !",null,null,null,null,null,"Voir le profil à BenderZ 22:22 c'est des joueurs qui vivent pour gagner (certains sont pro d'ailleurs comme sladdug)"]
[null,"Il n'y a pas de mystère :",null,null,null,null,null,null,null,null,null,null,null,null,null,null,null,null,"Voir le profil à BenderZ 22:24 à kaz : regarde sa 2eme cité à gnous...toujours la même configuration sur tous les serveurs bois/min/rare/rare"]
[null,null,null,null,null,null,null,null,null,null,null,null,"Y'a 2 compétences d'hérédité (contribution populaire et richesse perosnelle) qui l'aide beaucoup (CP en milieu/fin de jeu, RP surtout en début de partie).",null,null,null,null,null,"Voir le profil à BenderZ 22:26 d'ici 3 semaines il aura une armée de + ou - 100 t5 + déjà"]
[null,"- Un héros att/mag (ou déf/magie si on a la compétence d'hérédité permettant de lui donner qqes points d'attaque) en héros de départ",null,null,null,null,null,null,null,null,null,null,null,null,null,null,null,null,"Voir le profil à BenderZ 22:27 leur méthode? multiplier les combats en overun"]
[null,null,null,null,null,null,null,null,null,null,null,null,"Après comme le disent de nombreux tutos, moins on envoie de troupes combattre les PNJ, moins on a de pertes, plus la récompense est bonne, plus la richesse monte.",null,null,null,null,null,"Voir le profil à BenderZ 22:28 ils arrivent rapidement à cours de pn par contre et ont besoin du jcj pour avancer en honneur"]
[null,"- Recruter un 2e et 3e héros pour avoir des troupes (si possible en ayant mis la compétence \"enroleur charismatique\" sur le héros de départ)"]
[null,null,null,null,null,null,null,null,null,null,null,null,"Puis après y'a les trucs genre un héros batisseur - chercheur d'or et avoir la chance ou non de choper un harnais (+4% de prod d'or) sur les PNJ."]
[null,"- Se lancer dans les quêtes en les enchainant le + possible (pour cela, au début (pour genre 4 quêtes) faire 2 combats à la fois, en connaissant l'ordre des quetes et leurs objectifs)",null,null,null,null,null,null,null,null,null,null,"Puis comme le disent certains tutos, perf jusuq'au niveau 3 et ensuite simplement améliorer les mines est un bon compromis pour un départ rapide en richesse, qu'après chacun à sa façon de prolonger (ou pas^^)"]
[]
[null,"- Faire la guilde de magie niveau 1 rapidement en espérant avoir le meilleur des 2 sorts (genre fleche des arcanes (que j'aurais voulu mais n'ai pas eu!) pour destruction, essaim pour invocation)"]
[]
[null,"- Avoir un peu de chances sur les cases à libérer : des stacks de PnJ qui correspondent bien à nos troupes"]
[]
[null,"- Puis avoir certaines compétences d'hérédité qui aide le départ rapie, tu ne m'en voudras pas, je ne préfère pas dévoiler les miennes."]
[null,null,null,null,null,null,null,null,null,null,null,null,"Vigne"]
[null,"Voilà, j'espère que ça pourra t'aider un peu."]
[null,null,null,null,null,null,null,null,null,null,null,null,"Salut,"]
[null,"Sinon il y a des bons tutoriels complets à cette adresse :"]
[null,"http://pacte-enroth.forumactif.net/aide-de-jeu-f8/",null,null,null,null,null,null,null,null,null,null,"En saison 2 pour faire un bon départ il faut prendre Héro Talentueux lvl 5 sur ton 1er Héro (Hérédité)."]
[null,null,null,null,null,null,null,null,null,null,null,null,"Avec cela tu peux prendre Tavernier avec +135% d'unités en plus pour chaque Héro recruté."]
[null,null,null,null,null,null,null,null,null,null,null,null,"Ensuite tu recrutes rapidement 3 puis 4 Héros."]
[null,null,null,null,null,null,null,null,null,null,null,null,"Tu as bcp d'unité, tu peux donc normalement enchainer les combats avec 2 Héros tout en validant les quetes."]
[null,null,null,null,null,null,null,null,null,null,null,null,"Perso j'ai aussi Contribution Populaire et Tir de barrage pour enchainer encore mieux les combats."]
[null,"Valouf"]
[null,null,null,null,null,null,null,null,null,null,null,null,"Bon jeu,"]
[null,"Ce n'est pas si compliqué que ça en fait. :)"]
[null,null,null,null,null,null,null,null,null,null,null,null,"Vigne"]
[null,"Le truc, c'est de gérer ses pertes d'armées et donc son \"pool\". Les questions à se poser sont :",null,null,null,null,null,null,null,null,null,null,"---------------------------"]
[null,"As-tu fait toutes les quêtes de combat permettant ainsi d'avoir plus d'armée? Essayer d'atteindre le rang 1 domi avant de faire les combats à bcp de pertes ?"]
[null,"As-tu choisi un ordre de combat préférentiel de pertes d'armées et de puissances ? (Exemple : je perds 22 T1 sur celui-ci, 10 sur ce combat et 35 sur lui, autant faire le combat avec le plus de pertes (ici 35) d'abord pour enchainer les combats sans devoir attendre d'avoir les troupes nécessaires)"]
[]
[null,"Bref, je pense que tu as compris le principe, et bien sûr sous réserve que tes combats jactari soit optimisé comme il se doit. :)"]
[]
[null,"Si jamais tu as un doute, tu peux transférer tes rapports de combats (enfin 2-3 hein), cela ne me dérange pas de t'aider."]
[]
[]
[null,"La plupart des serveurs, j'ai ma V2 en 5-6 jours (bon ici 4 grâce à l'hérédité) quel que soit la race et sa magie. Je prépare un bâtiment de guilde de mage à un moment, mais seulement pour réaliser la quête, ça n'a pas tant d'influence que ça."]
[]
[null,"Et je combat avec qu'un seul héros aussi. Il m'arrive d'en avoir un autre au combat, mais c'est juste pour lui faire gagner de l'xp et sans préparer la future quête de combat (de toute façon, je n'étais pas co sur les fin de combats pour essayer d'optimiser l'enchainement)."]
[]
[null,"Donc ça se joue vraiment sur sa gestion de l'armée et des quêtes en essayant de faire un maximum d'honneur."]
[null,"Sur le jactari, je me met d'abord en condition max xp, et après je fais que quelques petit changement voire pas."]
[]
[null,"Par contre, je me pose une question aux niveaux des quêtes, as tu réalisé les quêtes une par une dès le début ? Car, sur les petits pack, tu ne perds pas grand chose et ton armée, avant d'attaquer les gros pack, est + grosse et te permet donc + de souplesse et + de faciliter à clean les monstres."]
[null,"D'où l'intérêt de nettoyer avec qu'un seul héros aussi pour éviter de tuer un pack \"sans récompense de quête\""]
[]
[]
[null,"Montre moi plutôt un de tes combats et je pourrais te dire si je vois une ptite astuce ou pas. :)"]
[]
[]
[]
[]
[null,"tybz"]
[null,"je t'avoue que je ne fais rien de spécial... jactari est mon dieu vivant et je suis à la lettre ses préceptes."]
[null,"J'essaie juste de faire correspondre une quête à chaque combat, et quand je n'ai plus de sous pour payer du développement, mes gestionnaires vont aussi au combat."]
[null,"quand je vois que je n'obtiens que des victroires moyennes sur mon simuilateur, je fais une pause kitkat en dépensant quelque spoints de talent."]
[null,"Ah! et comme c'est pas du pvp, on peut jouer à toute heure du jour et de la nuit! donc un combat toutes les 3h30!"]
[]
[null,"En plus j'ai pas eu de veine, j'ai quand même mangé deux défaites: fais bien attention d'activer la case \"saison 2\" en haut du simulateur, sinon tu ramasses tes dents"]
[null,"bonne nuit!"]
[]
[]
[null,"Hylian."]
[null,"Bonsoir,"]
[]
[null,"Avant toute chose il me faut souligner que ce que je vais dire n'a rien de \"nouveau\", je n'ai fait qu'appliquer les conseils et info diverses des forums :)"]
[]
[null,"Je parle uniquement d'une perspective S2. Ce n'est pas exhaustif, d'après les chroniques d'aujourd'hui les prochaines contiendront des infos à ce sujet."]
[]
[null,"Donc, dans les grandes lignes, déjà en hérédité ce que j'ai :"]
[]
[null,"- Héros Talentueux 3 (voir plus mais 3mini)"]
[null,"- Tir de Barrage (Pas indispensable mais aide bien sur les gros packs)"]
[null,"- Bouclier Honneur (Pareil, pas indispensable mais comme le dit Palladyn permets de palier à un éventuel manque de chance pour la quête artefact)."]
[]
[null,"Je commence avec un magicien dérangé, et la première chose avec dés qu'il est disponible c'est lui apprendre Enrôleur charismatique (+135% Troupes sur les héros recrutés), là encore ça vient des forums et notamment Enroth. Il faut savoir que un héros recruté avec c'est environ 11 000 d'armée. Pour le simple prix du héros bien sûr."]
[]
[null,"J'ai recruté deux héros, avec mes 3 héros je fais des combats optimisés autant que possible avec le génialissime simulateur de Jactari. Pour les premières cases seulement, ensuite je laisse les deux héros recrutés amél/perf les mines et le magicien dérangé s'occupe de tout nettoyer. Le plus important à ce point c'est enchaîner autant que possible et surtout, et je pense que c'est ce qui aide le plus, faire aussi vite que possible les quêtes. Les grosses récompenses d'or et d'unités aide énormément. Une quête par combat si possible c'est parfait."]
[]
[null,"Et c'est tout, j'insiste encore, rien d'extraordinaire : Hérédité adéquate, optimisation via simulateur de Jactari, valider les quêtes le plus vite possible."]
[]
[null,"Voilà, j'espère que ça t'aidera et bonne chance sur le serveur !"]
[]
[null,"Hylian."]
[]
[]
[null,"Bonjour,"]
[]
[null,"\"Je t'avoue, que ce qui me chagrine le plus, c'est le choix de mes combats: de manière générale, dois-je privilégier la sauvegarde des troupes ou bien les points d'expérience. Je suppose que tu me répondras le second point :-)\""]
[]
[null,"Je dois avouer que je n'ai pas de \"règle\" précise, au départ je donne clairement la priorité à l'expérience, exception faite des T3 & T4 que j'essaie de sauvegarder au maximum. Je m'adapte à l'état de mes stocks et je me cale sur les rentrées d'unités que je sais sûre, si je peux me le permettre je favorise l'xp au maximum, sinon j'essaie de sauvegarder des troupes quitte à prendre moins d'xp. J'adapte vraiment en fonction de ma situation."]
[]
[null,"Mais il faut savoir que je prévois toujours 1 à 3 combats à l'avance via simulateur, de façon à voir si je devrais faire tel ou tel combat avant. Par exemple si je sais qu'un combat va me couter 9 des mes 63 T2 et que j'en ai besoin de 59 pour un autre combat ou je vais en perdre 3 (ce genre de chiffres est totalement inexact, c'est vraiment pour l'exemple) je vais privilégier le second."]
[]
[null,"Je me sers d'une base de 1-3 combats à l'avance sur simulateur que j'adapte à ma situation et mets à jour constamment en essayant de voir comment optimiser au mieux, dans quel ordre etc."]
[]
[null,"Voilà j'espère que ceci t'aidera, bonne chance,"]
[]
[null,"Hylian."]

{"sheet":"Conditions de victoire","index":12,"n_rows":71,"n_cols":27,"rows_kept":71,"cut":false,"hidden":false,"merged":[[19,10,28,10],[19,11,28,11]]}
[]
[]
[]
[]
[]
[]
[null,null,null,"Majeure",null,null,"Moyenne",null,"Mineure","Mineure","Moyenne"]
[null,null,"Pertes (nb)",3002,null,null,3608,null,3608,3978,3978]
[null,null,"Pertes %"]
[null,null,"Modif. %",0.24579999999999999,null,null,-0.1477,null,-7.7100000000000002E-2,0.19489999999999999,0.2278]
[null,null,"XP",2154,null,null,978,null,1059,1371,1409,null,null,"Mettre des troupes qui ne servent à rien permettent de réduire le ratio de pertes"]
[null,null,null,null,null,null,null,null,null,null,null,null,null,"et parfois de passer sur une victoire supérieure (!)"]
[null,null,"Ratio",{"$f":"D11/D8","v":0.71752165223184539},null,null,{"$f":"G11/G8","v":0.27106430155210642},null,{"$f":"I11/I8","v":0.29351441241685144},null,{"$f":"K11/K8","v":0.35419808949220716}]
[]
[]
[]
[null,null,null,null,null,null,null,null,null,null,null,null,null,null,null,null,"TYPE DE VICTOIRE"]
[]
[null,null,null,null,null,null,null,null,null,null,null,null,-20,{"$f":"IF(N$32<10,2,IF(N$32>=20,0,1))+IF($M19<20,IF($M19<0,0,1),IF($M19>=80,3,2))","v":2},1,0]
[null,null,null,null,null,null,null,null,null,null,"Honneur (%)","(ratio troupes engagées)",-10,2,1,0]
[null,null,null,null,null,null,null,null,null,null,null,null,0,{"$f":"IF(N$32<10,2,IF(N$32>=20,0,1))+IF($M21<20,IF($M21<0,0,1),IF($M21>=80,3,2))","v":3},2,1,null,null,null,null,null,null,null,null,null,null,"Victoire "]
[null,null,null,null,null,null,null,null,null,null,null,null,10,{"$f":"IF(N$32<10,2,IF(N$32>=20,0,1))+IF($M22<20,IF($M22<0,0,1),IF($M22>=80,3,2))","v":3},2,1,null,null,null,null,null,null,null,null,null,0,"limitée"]
[null,null,null,null,null,null,null,null,"-20-0",0,null,null,20,4,3,2,null,null,null,null,null,null,null,null,null,1,"mineure"]
[null,null,null,null,null,null,null,null,"0-20",1,null,null,30,4,3,2,null,null,null,null,null,null,null,null,null,2,"moyenne"]
[null,null,null,null,null,null,null,null,"20-80",2,null,null,40,4,3,2,null,null,null,null,null,null,null,null,null,3,"majeure"]
[null,null,null,null,null,null,null,null,"80-100",3,null,null,50,4,3,2,null,null,null,null,null,null,null,null,null,4,"écrasante"]
[null,null,null,null,null,null,null,null,null,null,null,null,60,4,3,2,null,null,null,null,null,null,null,null,null,5,"légendaire"]
[null,null,null,null,null,null,null,null,null,null,null,null,70,4,3,2]
[null,null,null,null,null,null,null,null,null,null,null,null,80,5,4,3]
[null,null,null,null,null,null,null,null,null,null,null,null,90,5,4,3]
[null,null,null,null,null,null,null,null,null,null,null,null,100,5,4,3]
[null,null,null,null,null,null,null,null,null,null,null,null,null,0,10,20,30,40,50,60,70,80,90,100]
[]
[null,null,null,null,null,null,null,null,null,null,null,null,null,null,null,null,null,null,null,"Pertes (%)"]
[null,null,null,null,null,null,null,null,null,null,null,null,null,null,null,null,null,null,null,"(ratio de domination perdue)"]
[null,null,null,null,null,null,null,null,null,null,null,null,null,null,null,null,null,null,"0-10",2]
[null,null,null,null,null,null,null,null,null,null,null,null,null,null,null,null,null,null,"10-20",1]
[null,null,null,null,null,null,null,null,null,null,null,null,null,null,null,null,null,null,"20-30",0]
[]
[null,null,null,null,null,null,null,null,null,null,2139]
[]
[]
[null,null,null,null,null,null,null,null,null,null,null,"Pertes définitives"]
[null,null,null,null,null,null,null,null,null,null,null,"Attaquant",null,null,null,null,null,null,null,"Défenseur"]
[null,null,null,null,null,null,null,null,null,null,null,"Unité","Effectif",null,"Puissance",null,"Cout en or","Cout en rares","Peloton","Unité","Effectif",null,"Puissance",null,"Cout en or","Cout en rares"]
[null,null,null,null,null,null,null,null,null,null,null,null,"Initial","Perdu","Initiale","Perdue","des pertes","des pertes",null,null,"Initial","Perdu","Initiale","Perdue","des pertes","des pertes"]
[null,null,null,null,null,null,null,null,null,null,null,"Chien des enfersChien des enf.",13,3,"4 810","1 110","2 520","—",1,"GremlinGremlin",113,113,"8 023","8 023","21 357","—"]
[null,null,null,null,null,null,null,null,null,null,null,"SuccubeSuccube",2,1,"1 836",918,"1 848","—",2,"Golem d'acierGolem d'acier",9,9,"2 943","2 943","7 776","—"]
[null,null,null,null,null,null,null,null,null,null,null,"Démon cornuDémon cornu",28,1,"4 564",163,399,"—",3,"DjinnDjinn",2,2,"2 634","2 634","1 800","gemme 4"]
[null,null,null,null,null,null,null,null,null,null,null,null,43,5,"11 210","2 191","4 767","—","Total",null,124,124,"13 600","13 600","30 933",4]
[null,null,null,null,null,null,null,null,null,null,null,"Expérience"]
[null,null,null,null,null,null,null,null,null,null,null,"Attaquant",null,"Défenseur"]
[null,null,null,null,null,null,null,null,null,null,null,0.2132,"Honneur","/"]
[null,null,null,null,null,null,null,null,null,null,null,951,"Expérience de base","/"]
[null,null,null,null,null,null,null,null,null,null,null,0.2132,"Modificateur total","/"]
[null,null,null,null,null,null,null,null,null,null,null,"1 153","Expérience totale","/"]
[]
[null,null,null,null,null,null,null,null,null,null,null,"Pertes définitives"]
[null,null,null,null,null,null,null,null,null,null,null,"Attaquant",null,null,null,null,null,null,null,"Défenseur"]
[null,null,null,null,null,null,null,null,null,null,null,"Unité","Effectif",null,"Puissance",null,"Cout en or","Cout en rares","Peloton","Unité","Effectif",null,"Puissance",null,"Cout en or","Cout en rares"]
[null,null,null,null,null,null,null,null,null,null,null,null,"Initial","Perdu","Initiale","Perdue","des pertes","des pertes",null,null,"Initial","Perdu","Initiale","Perdue","des pertes","des pertes"]
[null,null,null,null,null,null,null,null,null,null,null,"FamilierFamilier",62,18,"5 332","1 548","4 068","—",1,"VampireVampire",11,11,"8 261","8 261","18 392","—"]
[null,null,null,null,null,null,null,null,null,null,null,"Démon cornuDémon cornu",27,8,"4 401","1 304","3 192","—",2,"Dragon squeletteDragon squel.",1,1,"5 866","5 866","—","mercure 10"]
[null,null,null,null,null,null,null,null,null,null,null,"SuccubeSuccube",3,1,"2 754",918,"1 848","—",3,"ApparitionApparition",1,1,"3 365","3 365","2 500","cristal 4"]
[null,null,null,null,null,null,null,null,null,null,null,null,92,27,"12 487","3 770","9 108","—","Total",null,13,13,"17 492","17 492","20 892",14]
[null,null,null,null,null,null,null,null,null,null,null,"Expérience"]
[null,null,null,null,null,null,null,null,null,null,null,"Attaquant",null,"Défenseur"]
[null,null,null,null,null,null,null,null,null,null,null,0.40079999999999999,"Honneur","/"]
[null,null,null,null,null,null,null,null,null,null,null,"1 555","Expérience de base","/"]
[null,null,null,null,null,null,null,null,null,null,null,0.40079999999999999,"Modificateur total","/"]
[null,null,null,null,null,null,null,null,null,null,null,"2 179","Expérience totale","/"]

{"sheet":"Combats","index":13,"n_rows":204,"n_cols":25,"rows_kept":204,"cut":false,"hidden":false,"merged":[[132,3,132,5],[118,3,118,5],[125,3,125,17],[126,3,126,9],[126,11,126,17],[127,3,128,3],[127,4,127,5],[127,6,127,7],[127,10,128,10],[127,11,128,11],[127,12,127,13],[127,14,127,15],[103,3,103,5],[110,3,110,17],[111,3,111,9],[111,11,111,17],[112,3,113,3],[112,4,112,5],[112,6,112,7],[112,10,113,10],[112,11,113,11],[112,12,112,13],[112,14,112,15],[54,3,54,9],[56,3,56,5],[99,3,99,9],[100,3,100,9],[94,3,94,9],[101,3,101,9],[79,3,80,3],[79,4,79,5],[79,6,79,7],[94,11,94,17],[95,3,96,3],[95,4,95,5],[95,6,95,7],[95,10,96,10],[95,11,96,11],[95,12,95,13],[95,14,95,15],[93,3,93,17],[79,10,80,10],[79,11,80,11],[79,12,79,13],[79,14,79,15],[86,3,86,5],[65,14,65,15],[77,3,77,17],[78,3,78,9],[78,11,78,17],[65,3,66,3],[65,4,65,5],[65,6,65,7],[65,10,66,10],[65,11,66,11],[65,12,65,13],[70,3,70,5],[49,12,49,13],[49,14,49,15],[63,3,63,17],[64,3,64,9],[64,11,64,17],[34,14,34,15],[40,3,40,5],[47,3,47,17],[48,3,48,9],[48,11,48,17],[49,3,50,3],[49,4,49,5],[49,6,49,7],[49,10,50,10],[49,11,50,11],[34,3,35,3],[34,4,34,5],[34,6,34,7],[34,10,35,10],[34,11,35,11],[34,12,34,13],[38,3,38,9],[52,3,52,9],[53,3,53,9],[19,14,19,15],[32,3,32,17],[33,3,33,9],[33,11,33,17],[19,3,20,3],[19,4,19,5],[19,6,19,7],[19,10,20,10],[19,11,20,11],[19,12,19,13],[25,3,25,5],[10,3,10,5],[17,3,17,17],[18,3,18,9],[18,11,18,17],[1,3,1,17],[2,3,2,9],[2,11,2,17],[3,3,4,3],[3,4,3,5],[3,6,3,7],[3,10,4,10],[3,11,4,11],[3,12,3,13],[3,14,3,15],[8,3,8,9]]}
["Mlinimiser les pertes"]
[null,null,2,"Pertes définitives"]
[null,null,null,"Attaquant",null,null,null,null,null,null,null,"Défenseur"]
[null,null,null,"Unité","Effectif",null,"Puissance",null,"Cout en or","Cout en rares","Peloton","Unité","Effectif",null,"Puissance",null,"Cout en or","Cout en rares"]
[null,null,null,null,"Initial","Perdu","Initiale","Perdue","des pertes","des pertes",null,null,"Initial","Perdu","Initiale","Perdue","des pertes","des pertes"]
[null,null,null,"Démon cornu",43,12,7009,1956,4788,"—",1,"Gargouille de pierre",65,65,7800,7800,22230,"—"]
[null,null,null,"Chien des enfers",18,5,6660,1850,4200,"—",2,"Archimage",9,9,7281,7281,17100,"—"]
[null,null,null,"Familier",84,"—",7224,"—","—","—",3,"Gargouille d'obsidienne",26,26,3744,3744,10660,"—"]
[null,null,null,null,null,null,null,null,null,null,4,"Raja Rakshasa",1,1,2950,2950,2300,4]
[null,null,null,null,145,17,20893,3806,8988,"—","Total",null,101,101,21775,21775,52290,4]
[null,null,null,"Expérience"]
[null,null,null,"Attaquant",null,"Défenseur"]
[null,null,null,4.2200000000000001E-2,"Honneur","/"]
[null,null,null,1622,"Expérience de base","/"]
[null,null,null,4.2200000000000001E-2,"Modificateur total","/"]
[null,{"$f":"D16/H10","v":0.44429847609038359},null,1691,"Expérience totale","/"]
[]
[null,null,null,"Pertes définitives"]
[null,null,null,"Attaquant",null,null,null,null,null,null,null,"Défenseur"]
[null,null,null,"Unité","Effectif",null,"Puissance",null,"Cout en or","Cout en rares","Peloton","Unité","Effectif",null,"Puissance",null,"Cout en or","Cout en rares"]
[null,null,null,null,"Initial","Perdu","Initiale","Perdue","des pertes","des pertes",null,null,"Initial","Perdu","Initiale","Perdue","des pertes","des pertes"]
[null,null,null,"Démon cornu",36,10,5868,1630,3990,"—",1,"Dragon d'émeraude",1,1,9077,9077,"—",14]
[null,null,null,"Familier",24,7,2064,602,1582,"—",2,"Maitre chasseur",14,14,7532,7532,15526,"—"]
[null,null,null,"Chien des enfers",18,5,6660,1850,4200,"—",3,"Licorne",3,3,5127,5127,3300,6]
[null,null,null,null,78,22,14592,4082,9772,"—","Total",null,18,18,21736,21736,18826,20]
[null,null,null,"Expérience"]
[null,null,null,"Attaquant",null,"Défenseur"]
[null,null,null,0.48959999999999998,"Honneur","/"]
[null,null,null,1837,"Expérience de base","/"]
[null,null,null,0.48959999999999998,"Modificateur total","/"]
[null,{"$f":"D31/H25","v":0.67025967662910335},null,2736,"Expérience totale","/"]
[]
[null,null,null,"Pertes définitives"]
[null,null,null,"Attaquant",null,null,null,null,null,null,null,"Défenseur"]
[null,null,null,"Unité","Effectif",null,"Puissance",null,"Cout en or","Cout en rares","Peloton","Unité","Effectif",null,"Puissance",null,"Cout en or","Cout en rares"]
[null,null,null,null,"Initial","Perdu","Initiale","Perdue","des pertes","des pertes",null,null,"Initial","Perdu","Initiale","Perdue","des pertes","des pertes"]
[null,null,null,"Démon cornu",36,10,5868,1630,3990,"—",1,"Dragon d'émeraude",1,1,9077,9077,"—",14]
[null,null,null,"Chien des enfers",15,3,5550,1110,2520,"—",2,"Druide séculaire",4,4,4404,4404,8872,"—"]
[null,null,null,null,null,null,null,null,null,null,3,"Fine-lame",17,17,2771,2771,6783,"—"]
[null,null,null,null,51,13,11418,2740,6510,"—","Total",null,22,22,16252,16252,15655,14]
[null,null,null,"Expérience"]
[null,null,null,"Attaquant",null,"Défenseur"]
[null,null,null,0.4234,"Honneur","/"]
[null,null,null,1459,"Expérience de base","/"]
[null,null,null,0.4234,"Modificateur total","/"]
[null,{"$f":"D46/H40","v":0.75802919708029193},null,2077,"Expérience totale","/"]
[]
[null,null,null,"Pertes définitives"]
[null,null,null,"Attaquant",null,null,null,null,null,null,null,"Défenseur"]
[null,null,null,"Unité","Effectif",null,"Puissance",null,"Cout en or","Cout en rares","Peloton","Unité","Effectif",null,"Puissance",null,"Cout en or","Cout en rares"]
[null,null,null,null,"Initial","Perdu","Initiale","Perdue","des pertes","des pertes",null,null,"Initial","Perdu","Initiale","Perdue","des pertes","des pertes"]
[null,null,null,"Succube",6,1,5508,918,1848,"—",1,"Démon gardien",23,23,4508,4508,10994,"—"]
[null,null,null,null,null,null,null,null,null,null,2,"Cheval infernal",1,1,1795,1795,1100,2]
[null,null,null,null,null,null,null,null,null,null,3,"Maitresse succube",1,1,1101,1101,2217,"—"]
[null,null,null,null,null,null,null,null,null,null,4,"Succube",1,1,918,918,1848,"—"]
[null,null,null,null,6,1,5508,918,1848,"—","Total",null,26,26,8322,8322,16159,2]
[null,null,null,"Expérience"]
[null,null,null,"Attaquant",null,"Défenseur"]
[null,null,null,0.51090000000000002,"Honneur","/"]
[null,null,null,618,"Expérience de base","/"]
[null,null,null,0.51090000000000002,"Modificateur total","/"]
[null,{"$f":"D62/H56","v":1.0174291938997821},null,934,"Expérience totale","/"]
[]
[null,null,null,"Pertes définitives"]
[null,null,null,"Attaquant",null,null,null,null,null,null,null,"Défenseur"]
[null,null,null,"Unité","Effectif",null,"Puissance",null,"Cout en or","Cout en rares","Peloton","Unité","Effectif",null,"Puissance",null,"Cout en or","Cout en rares"]
[null,null,null,null,"Initial","Perdu","Initiale","Perdue","des pertes","des pertes",null,null,"Initial","Perdu","Initiale","Perdue","des pertes","des pertes"]
[null,null,null,"Chien des enfers",18,5,6660,1850,4200,"—",1,"Inquisiteur",4,4,10300,10300,6800,12]
[null,null,null,"Succube",6,1,5508,918,1848,"—",2,"Ange",1,1,7150,7150,"—",10]
[null,null,null,null,24,6,12168,2768,6048,"—","Total",null,5,5,17450,17450,6800,22]
[null,null,null,"Expérience"]
[null,null,null,"Attaquant",null,"Défenseur"]
[null,null,null,0.43409999999999999,"Honneur","/"]
[null,null,null,1573,"Expérience de base","/"]
[null,null,null,0.43409999999999999,"Modificateur total","/"]
[null,{"$f":"D76/H70","v":0.81502890173410403},null,2256,"Expérience totale","/"]
[]
[null,null,null,"Pertes définitives",null,null,null,null,null,null,null,null,null,null,null,null,null,null,null,"COMBAT 1"]
[null,null,null,"Attaquant",null,null,null,null,null,null,null,"Défenseur",null,null,null,null,null,null,null,null,"zombies","achers squelette",null,"gain : mercure"]
[null,null,null,"Unité","Effectif",null,"Puissance",null,"Cout en or","Cout en rares","Peloton","Unité","Effectif",null,"Puissance",null,"Cout en or","Cout en rares",null,"actuel",28,62]
[null,null,null,null,"Initial","Perdu","Initiale","Perdue","des pertes","des pertes",null,null,"Initial","Perdu","Initiale","Perdue","des pertes","des pertes",null,"réserves",36,31]
[null,null,null,"Démon cornu",33,9,5379,1467,3591,"—",1,"Dragon spectral",1,1,8213,8213,"—",14,null,"manque",{"$f":"E83-(U80+U81)","v":-46},{"$f":"E82-(V80+V81)","v":-60},null,"32 zombies dispersent 6 cerbères"]
[null,null,null,"Chien des enfers",18,5,6660,1850,4200,"—",2,"Archer squelette",105,105,7350,7350,21525,"—",null,"prod / J",8,null,null,null,"3 squelettes"]
[null,null,null,"Démon cornu",10,3,1630,489,1197,"—",3,"Fantôme",19,19,5757,5757,14440,"—",null,"dispo dans",{"$f":"U82/U83*24","v":-138},null,null,null,"4 fantomes"]
[null,null,null,"Familier",84,13,7224,1118,2938,"—",4,"Liche",3,3,4290,4290,3000,6]
[null,null,null,null,145,30,20893,4924,11926,"—","Total",null,128,128,25610,25610,38965,20,null,"acheter",{"$f":"E83-U80","v":-10},{"$f":"E82-V80","v":-29}]
[null,null,null,"Expérience",null,null,null,null,null,null,null,null,null,null,null,null,null,null,null,"cout or",{"$f":"U86*Domination!D7","v":-3610},{"$f":"V86*Domination!D6","v":-5945},null,"durée du combat : 3h53"]
[null,null,null,"Attaquant",null,"Défenseur",null,null,null,null,null,null,null,null,null,null,null,null,null,null,null,null,null,"temps pour accumuler 8000 or ?"]
[null,null,null,0.2258,"Honneur","/",null,null,null,null,null,null,null,null,null,null,null,null,null,null,null,null,null,"Fin dans 11 heures"]
[null,null,null,2053,"Expérience de base","/",null,null,null,null,null,null,null,null,null,null,null,null,null,null,null,null,null,"anticiper l'achat des squelettes (long)"]
[null,null,null,0.2258,"Modificateur total","/"]
[null,{"$f":"D92/H86","v":0.51096669374492287},null,2516,"Expérience totale","/"]
[]
[null,null,1,"Pertes définitives",null,null,null,null,null,null,null,null,null,null,null,null,null,null,null,"COMBAT 2",null,null,null,"gain : bois"]
[null,null,null,"Attaquant",null,null,null,null,null,null,null,"Défenseur",null,null,null,null,null,null,null,null,null,null,null,"gain : 15 k or"]
[null,null,null,"Unité","Effectif",null,"Puissance",null,"Cout en or","Cout en rares","Peloton","Unité","Effectif",null,"Puissance",null,"Cout en or","Cout en rares"]
[null,null,null,null,"Initial","Perdu","Initiale","Perdue","des pertes","des pertes",null,null,"Initial","Perdu","Initiale","Perdue","des pertes","des pertes",null,null,"fantomes"]
[null,null,null,"Démon cornu",24,7,3912,1141,2793,"—",1,"Nymphe",74,74,6512,6512,15540,"—",null,"actuel",13,"(13 avec combat 1)"]
[null,null,null,"Chien des enfers",18,4,6660,1480,3360,"—",2,"Maitre chasseur",10,10,5380,5380,11090,"—",null,"réserves",7]
[null,null,null,null,null,null,null,null,null,null,3,"Chasseur",7,7,3136,3136,6468,"—",null,"manque",{"$f":"E101-(U98+U99)","v":-20}]
[null,null,null,null,null,null,null,null,null,null,4,"Licorne d'argent",1,1,2541,2541,1600,3,null,"prod / J",8]
[null,null,null,null,null,null,null,null,null,null,5,"Licorne",1,1,1709,1709,1100,2,null,"dispo dans",{"$f":"U100/U101*24","v":-60},"heures "]
[null,null,null,null,42,11,10572,2621,6153,"—","Total",null,93,93,19278,19278,35798,5,null,null,null,null,null,"restera 10 h d'attente après combat 1"]
[null,null,null,"Expérience",null,null,null,null,null,null,null,null,null,null,null,null,null,null,null,"cout or ",{"$f":"7*Domination!D9","v":5320},null,null,"anticiper l'achat des fantomes (long)"]
[null,null,null,"Attaquant",null,"Défenseur"]
[null,null,null,0.82350000000000001,"Honneur","/"]
[null,null,null,1356,"Expérience de base","/"]
[null,null,null,0.82350000000000001,"Modificateur total","/"]
[null,{"$f":"D109/H103","v":0.94353300267073636},null,2473,"Expérience totale","/"]
[]
[null,null,null,"Pertes définitives",null,null,null,null,null,null,null,null,null,null,null,null,null,null,null,null,"achers squelette"]
[null,null,null,"Attaquant",null,null,null,null,null,null,null,"Défenseur",null,null,null,null,null,null,null,"actuel",62,null,null,null,"93 archers squelette"]
[null,null,null,"Unité","Effectif",null,"Puissance",null,"Cout en or","Cout en rares","Peloton","Unité","Effectif",null,"Puissance",null,"Cout en or","Cout en rares",null,"réserves",31,null,null,null,"33 zombies"]
[null,null,null,null,"Initial","Perdu","Initiale","Perdue","des pertes","des pertes",null,null,"Initial","Perdu","Initiale","Perdue","des pertes","des pertes",null,"manque",{"$f":"E113-(U112+U113)","v":{"$error":"#VALUE!"}}]
[null,null,null,"Chien des enfers",18,5,6660,1850,4200,"—",1,"Titan",1,1,8190,8190,"—",14,null,"prod / J",19,null,"balayer les cerbère"]
[null,null,null,"Démon cornu",43,12,7009,1956,4788,"—",2,"Ingénieur gremlin",83,83,7138,7138,18758,"—",null,"dispo dans",{"$f":"U114/U115*24","v":{"$error":"#VALUE!"}},"heures "]
[null,null,null,"Familier",22,6,1892,516,1356,"—",3,"Djinn",3,3,3951,3951,2700,6]
[null,null,null,null,83,23,15561,4322,10344,"—","Total",null,87,87,19279,19279,21458,20]
[null,null,null,"Expérience"]
[null,null,null,"Attaquant",null,"Défenseur"]
[null,null,null,0.2389,"Honneur","/"]
[null,null,null,1624,"Expérience de base","/"]
[null,null,null,0.2389,"Modificateur total","/"]
[null,{"$f":"D124/H118","v":0.46552521980564554},null,2012,"Expérience totale","/"]
[]
[null,null,null,"Pertes définitives"]
[null,null,null,"Attaquant",null,null,null,null,null,null,null,"Défenseur"]
[null,null,null,"Unité","Effectif",null,"Puissance",null,"Cout en or","Cout en rares","Peloton","Unité","Effectif",null,"Puissance",null,"Cout en or","Cout en rares"]
[null,null,null,null,"Initial","Perdu","Initiale","Perdue","des pertes","des pertes",null,null,"Initial","Perdu","Initiale","Perdue","des pertes","des pertes"]
[null,null,null,"Succube",6,1,5508,918,1848,"—",1,"Conscrit",67,67,8576,8576,18559,"—"]
[null,null,null,"Familier",50,2,4300,172,452,"—",2,"Paysan",32,32,3104,3104,7040,"—"]
[null,null,null,null,56,3,9808,1090,2300,"—","Total",null,99,99,11680,11680,25599,"—"]
[null,null,null,"Expérience"]
[null,null,null,"Attaquant",null,"Défenseur"]
[null,null,null,0.19089999999999999,"Honneur","/"]
[null,null,null,779,"Expérience de base","/"]
[null,null,null,0.19089999999999999,"Modificateur total","/"]
[null,{"$f":"D138/H132","v":0.85045871559633024},null,927,"Expérience totale","/"]
[]
[]
[null,null,null,null,null,null,null,null,null,null,null,null,null,null,null,null,null,null,null,null,"COMBAT 3"]
[null,null,null,null,null,null,null,null,null,null,null,null,null,null,null,null,null,null,null,null,"achers squelette","zombies","fantomes"]
[null,null,null,null,null,null,null,null,null,null,null,null,null,null,null,null,null,null,null,"nécessite",null,null,42]
[null,null,null,null,null,null,null,null,null,null,null,null,null,null,null,null,null,null,null,"actuel",67,32,21]
[null,null,null,null,null,null,null,null,null,null,null,null,null,null,null,null,null,null,null,"réserves",22,45,3]
[]
[null,null,null,null,null,null,null,null,null,null,null,null,null,null,null,null,null,null,null,"manque",null,null,{"$f":"W143-(W144+W145)","v":18}]
[null,null,null,null,null,null,null,null,null,null,null,null,null,null,null,null,null,null,null,"prod / J",null,null,8]
[null,null,null,null,null,null,null,null,null,null,null,null,null,null,null,null,null,null,null,"dispo dans x heures",null,null,{"$f":"W147/W148*24","v":54}]
[]
[null,null,null,null,null,null,null,null,null,null,null,null,null,null,null,null,null,null,null,"acheter",null,null,{"$f":"W143-W144","v":21}]
[null,null,null,null,null,null,null,null,null,null,null,null,null,null,null,null,null,null,null,"cout or",{"$f":"U151*Domination!$D$6","v":0},{"$f":"V151*Domination!$C$7","v":0},{"$f":"IF(W151*Domination!$D$9>0,W151*Domination!$D$9,0)","v":15960}]
[]
[]
[]
[]
[]
[]
[]
[]
[]
[]
[]
[]
[]
[]
[]
[]
[]
[]
[null,null,null,null,null,null,null,null,null,null,null,null,null,null,null,null,null,null,null,null,"COMBAT 3",null,"tout juste compensé par les troupes gagnées"]
[null,null,null,null,null,null,null,null,null,null,null,null,null,null,null,null,null,null,null,null,"achers squelette","zombies","fantomes"]
[null,null,null,null,null,null,null,null,null,null,null,null,null,null,null,null,null,null,null,"nécessite",null,77,15]
[null,null,null,null,null,null,null,null,null,null,null,null,null,null,null,null,null,null,null,"actuel",67,32,21]
[null,null,null,null,null,null,null,null,null,null,null,null,null,null,null,null,null,null,null,"réserves",22,45,3]
[]
[null,null,null,null,null,null,null,null,null,null,null,null,null,null,null,null,null,null,null,"manque",null,{"$f":"V173-(V174+V175)","v":0},{"$f":"W173-(W174+W175)","v":-9}]
[null,null,null,null,null,null,null,null,null,null,null,null,null,null,null,null,null,null,null,"prod / J",null,8,8]
[null,null,null,null,null,null,null,null,null,null,null,null,null,null,null,null,null,null,null,"dispo dans x heures",null,{"$f":"V177/V178*24","v":0},{"$f":"W177/W178*24","v":-27}]
[]
[null,null,null,null,null,null,null,null,null,null,null,null,null,null,null,null,null,null,null,"acheter",null,{"$f":"V173-V174","v":45},{"$f":"W173-W174","v":-6}]
[null,null,null,null,null,null,null,null,null,null,null,null,null,null,null,null,null,null,null,"cout or",{"$f":"IF(U181*Domination!$D$6>0,U181*Domination!$D$6,0)","v":0},{"$f":"IF(V181*Domination!$D$7>0,V181*Domination!$D$7,0)","v":16245},{"$f":"IF(W181*Domination!$D$9>0,W181*Domination!$D$9,0)","v":0}]
[null,null,null,null,null,null,null,null,null,null,null,null,null,null,null,null,null,null,null,null,"Passer en zombies pestinentiels (11 et 83)"]
[]
[null,null,null,null,null,null,null,null,null,null,null,null,null,null,null,null,null,null,null,null,"COMBAT 3b",null,"tout juste compensé par les troupes gagnées"]
[null,null,null,null,null,null,null,null,null,null,null,null,null,null,null,null,null,null,null,null,"achers squelette","zombies","fantomes"]
[null,null,null,null,null,null,null,null,null,null,null,null,null,null,null,null,null,null,null,"nécessite",null,87]
[null,null,null,null,null,null,null,null,null,null,null,null,null,null,null,null,null,null,null,"actuel",67,32,21]
[null,null,null,null,null,null,null,null,null,null,null,null,null,null,null,null,null,null,null,"réserves",22,48,3]
[]
[null,null,null,null,null,null,null,null,null,null,null,null,null,null,null,null,null,null,null,"manque",null,{"$f":"V187-(V188+V189)","v":7},{"$f":"W187-(W188+W189)","v":-24}]
[null,null,null,null,null,null,null,null,null,null,null,null,null,null,null,null,null,null,null,"prod / J",null,8,8]
[null,null,null,null,null,null,null,null,null,null,null,null,null,null,null,null,null,null,null,"dispo dans x heures",null,{"$f":"V191/V192*24","v":21},{"$f":"W191/W192*24","v":-72}]
[]
[null,null,null,null,null,null,null,null,null,null,null,null,null,null,null,null,null,null,null,"acheter",null,{"$f":"V187-V188","v":55},{"$f":"W187-W188","v":-21}]
[null,null,null,null,null,null,null,null,null,null,null,null,null,null,null,null,null,null,null,"cout or",{"$f":"IF(U195*Domination!$D$6>0,U195*Domination!$D$6,0)","v":0},{"$f":"IF(V195*Domination!$D$7>0,V195*Domination!$D$7,0)","v":19855},{"$f":"IF(W195*Domination!$D$9>0,W195*Domination!$D$9,0)","v":0}]
[null,null,null,null,null,null,null,null,null,null,null,null,null,null,null,null,null,null,null,null,"Passer en zombies pestinentiels (11 et 83)"]
[]
[null,null,null,null,null,null,null,null,null,null,null,null,null,null,null,null,null,null,"combat 1",null,"Mage de guerre","L9","Reste",2816]
[null,null,null,null,null,null,null,null,null,null,null,null,null,null,null,null,null,null,null,null,22,"fantomes",{"$f":"U200-6+13+2+4","v":35}]
[null,null,null,null,null,null,null,null,null,null,null,null,null,null,null,null,null,null,null,null,104,"archers squelettes",{"$f":"U201-31+4","v":77}]
[null,null,null,null,null,null,null,null,null,null,null,null,null,null,null,null,null,null,null,null,10,"squelettes",{"$f":"U202-3","v":7}]
[null,null,null,null,null,null,null,null,null,null,null,null,null,null,null,null,null,null,null,null,25,"zombies",{"$f":"U203-6+41+2+6","v":68}]
[null,null,null,null,null,null,null,null,null,null,null,null,null,null,null,null,null,null,null,null,null,"vampires",5]

{"sheet":"HD2.1","index":14,"n_rows":197,"n_cols":75,"rows_kept":197,"cut":false,"hidden":false,"merged":[[113,2,113,16],[101,2,102,2],[101,3,101,4],[101,5,101,6],[101,9,102,9],[101,10,102,10],[121,2,121,4],[114,2,114,8],[114,10,114,16],[115,2,116,2],[115,3,115,4],[115,5,115,6],[115,9,116,9],[115,10,116,10],[115,11,115,12],[115,13,115,14],[89,2,89,8],[91,2,91,4],[99,2,99,16],[100,2,100,8],[100,10,100,16],[101,11,101,12],[101,13,101,14],[106,2,106,4],[104,2,104,8],[37,10,38,10],[37,11,37,12],[83,2,83,16],[84,2,84,8],[84,10,84,16],[85,2,86,2],[85,3,85,4],[85,5,85,6],[85,9,86,9],[85,10,86,10],[85,11,85,12],[85,13,85,14],[69,11,69,12],[69,13,69,14],[74,2,74,8],[76,2,76,4],[69,2,70,2],[69,3,69,4],[69,5,69,6],[69,9,70,9],[69,10,70,10],[25,2,25,8],[67,2,67,16],[68,2,68,8],[68,10,68,16],[19,2,19,16],[20,2,20,8],[20,10,20,16],[21,2,22,2],[21,3,21,4],[21,5,21,6],[21,9,22,9],[21,10,22,10],[21,11,21,12],[21,13,21,14],[37,13,37,14],[42,2,42,4],[27,2,27,4],[35,2,35,16],[36,2,36,8],[36,10,36,16],[37,2,38,2],[37,3,37,4],[37,5,37,6],[37,9,38,9],[146,13,146,14],[128,2,128,16],[129,2,129,8],[129,10,129,16],[130,2,131,2],[130,3,130,4],[130,5,130,6],[130,9,131,9],[130,10,131,10],[130,11,130,12],[130,13,130,14],[168,2,168,4],[138,8,138,10],[135,2,135,8],[137,2,137,4],[151,2,151,4],[159,2,159,16],[160,2,160,8],[160,10,160,16],[161,2,162,2],[161,3,161,4],[161,5,161,6],[161,9,162,9],[161,10,162,10],[161,11,161,12],[161,13,161,14],[144,2,144,16],[145,2,145,8],[145,10,145,16],[146,2,147,2],[146,3,146,4],[146,5,146,6],[146,9,147,9],[146,10,147,10],[146,11,146,12],[191,2,191,4],[182,2,182,16],[183,2,183,8],[183,10,183,16],[184,2,185,2],[184,3,184,4],[184,5,184,6],[184,9,185,9],[184,10,185,10],[184,11,184,12],[184,13,184,14]]}
[null,null,null,null,null,"Niv. 7 Magicien dérangé",null,null,null,null,null,null,null,null,null,null,null,null,null,null,null,null,null,null,null,null,null,null,"LANCER LES COMBATS EN //",null,null,null,null,null,null,"OPTIMISER LES XP",null,null,null,null,null,null,null,null,null,null,null,null,null,null,null,null,null,null,null,null,null,null,null,null,null,null,null,null,null,null,17,17,12,null,9,null,null,null,"Accroissement"]
[null,null,null,null,null,null,null,null,null,null,null,null,null,null,null,null,null,null,null,null,null,null,null,null,null,null,null,null,null,null,null,null,null,"ENGAGES/BESOINS",null,null,null,null,null,null,null,"PERTES/GAINS",null,null,null,null,null,null,null,"ACHATS/BESOINS SUP.",null,null,null,null,null,null,null,"TOTAL DISPONIBLES",null,null,null,null,null,null,null,null,null,null,"RESERVES"]
[null,null,"Pertes définitives",null,null,null,null,null,null,null,null,null,null,null,null,null,null,null,null,null,null,null,null,null,null,null,null,null,null,null,null," ","Famillier","Démon cornu"," ","Chien des enfers"," ","Succube",null," ","Famillier","Démon cornu"," ","Chien des enfers"," ","Succube",null," ","Famillier","Démon cornu"," ","Chien des enfers"," ","Succube",null," ","Famillier","Démon cornu"," ","Chien des enfers"," ","Succube",null,null,null,"Fin"," ","Famillier","Démon cornu"," ","Chien des enfers"," ","Succube"]
[null,null,"Attaquant",null,null,null,null,null,null,null,"Défenseur",null,null,null,null,null,null,null,null,null,null,null,null,null,null,null,null,null,"Qx","Pos","Manque","T1","T1+","T2","T2+","T3","T3+","T4","T4+","T1","T1+","T2","T2+","T3","T3+","T4","T4+","T1","T1+","T2","T2+","T3","T3+","T4","T4+","T1","T1+","T2","T2+","T3","T3+","T4","T4+","XP","Total XP","Date Heure","T1","T1+","T2","T2+","T3","T3+","T4","T4+","Maintenant"]
[null,null,"Unité","Effectif",null,"Puissance",null,"Cout en or","Cout en rares","Peloton","Unité","Effectif",null,"Puissance",null,"Cout en or","Cout en rares",null,null,null,null,null,null,null,null,null,null,null,null,null,null,null,null,null,null,null,null,null,null,null,null,null,null,null,null,null,null,null,null,null,null,null,null,null,null,null,97,42,null,20,null,9,4,null,{"$f":"12317+1759","v":14076},"2010-09-18T12:39:00",19,19,13,null,5,null,null,null,{"$f":"NOW()","v":"2010-09-29T23:41:22.700"}]
[null,null,null,"Initial","Perdu","Initiale","Perdue","des pertes","des pertes",null,null,"Initial","Perdu","Initiale","Perdue","des pertes","des pertes",null,"A","B","C","D","E",null,null,null,null,null,"Q9","E3",{"$f":"IF(AF6<=BD5+AV6,0,AF6-(BD5+AV6))+IF(AG6<=BE5+AW6,0,AG6-(BE5+AW6))+IF(AH6<=BF5+AX6,0,AH6-(BF5+AX6))+IF(AI6<=BG5+AY6,0,AI6-(BG5+AY6))+IF(AJ6<=BH5+AZ6,0,AJ6-(BH5+AZ6))+IF(AK6<=BI5+BA6,0,AK6-(BI5+BA6))+IF(AL6<=BJ5+BB6,0,AL6-(BJ5+BB6))+IF(AM6<=BK5+BC6,0,AM6-(BK5+BC6))","v":0},null,null,39,null,14,null,null,null,null,null,-6,null,-3,null,3,null,null,null,null,null,null,null,null,null,{"$f":"BD5+AN6+AV6","v":0},{"$f":"BE5+AO6+AW6","v":97},36,0,17,0,12,4,2266,{"$f":"BM5+BL6","v":16342},"2010-09-18T13:39:00"]
[null,null,"Démon cornu",39,11,"6 357","1 793","4 389","—",1,"NympheNymphe",74,74,"6 512","6 512","15 540","—",null,null,null,null,null,null,1,null,null,null,null,null,"E4",0,null,null,41,null,18,null,null,null,null,null,-12,null,-5,null,null,null,null,null,9,null,3,null,null,null,{"$f":"BD6+AN7+AV7","v":0},{"$f":"BE6+AO7+AW7","v":97},{"$f":"BF6+AP7+AX7","v":33},{"$f":"BG6+AQ7+AY7","v":0},{"$f":"BH6+AR7+AZ7","v":15},{"$f":"BI6+AS7+BA7","v":0},{"$f":"BJ6+AT7+BB7","v":12},{"$f":"BK6+AU7+BC7","v":4},2347,{"$f":"BM6+BL7","v":18689}]
[null,null,"Chien des enfers",14,3,"5 180","1 110","2 520","—",2,"Maitre chasseurMaitre chasseur",10,10,"5 380","5 380","11 090","—",null,null,null,null,null,null,2,null,null,null,null,null,"D1",0,null,null,null,null,null,null,6,null,null,null,null,null,null,null,-1,null,null,null,null,null,null,null,null,null,0,97,33,0,15,0,11,4,934,19623]
[null,null,null,null,null,null,null,null,null,3,"ChasseurChasseur",7,7,"3 136","3 136","6 468","—",null,null,null,null,null,"O",3,null,null,null,null,null,"D5",0,null,null,36,null,14,null,null,null,null,null,-10,null,-3,null,null,null,null,null,3,null,null,null,null,null,0,97,26,0,12,0,11,4,2147,21770,"2010-09-18T20:52:00"]
[null,null,null,null,null,null,null,null,null,4,"Licorne d'argentLicorne d'argent",1,1,"2 541","2 541","1 600","gemme 3",null,null,null,null,null,null,4,null,null,null,null,null,"E5",0,null,50,null,null,null,null,3,null,null,-14,null,null,null,null,-1,null,null,null,null,null,null,null,null,null,0,83,26,0,12,0,10,4,1289,23059,"2010-09-18T21:01:00"]
[null,null,null,null,null,null,null,null,null,5,"LicorneLicorne",1,1,"1 709","1 709","1 100","gemme 2",null,null,null,null,null,null,5,null,null,null,null,null,"C5",0,null,null,null,null,null,null,10,null,null,null,null,null,null,null,-2,null,null,null,null,null,null,null,null,null,{"$f":"BD10+AN11+AV11","v":0},{"$f":"BE10+AO11+AW11","v":83},{"$f":"BF10+AP11+AX11","v":26},{"$f":"BG10+AQ11+AY11","v":0},{"$f":"BH10+AR11+AZ11","v":12},{"$f":"BI10+AS11+BA11","v":0},{"$f":"BJ10+AT11+BB11","v":8},{"$f":"BK10+AU11+BC11","v":4},1660,24719,{"$f":"BN10+3.75/24","v":"2010-09-19T00:46:00"}]
[null,null,null,53,14,"11 537","2 903","6 909","—","Total",null,93,93,"19 278","19 278","35 798",5,null,null,null,null,null,null,null,null,null,null,null,null,"A4",0,null,24,36,null,18,null,null,null,null,-10,-7,null,-5,null,null,null,null,null,17,null,6,null,null,null,0,73,36,0,13,0,8,4,2736,{"$f":"BM11+BL16","v":27270},{"$f":"BN9+3.75/24","v":"2010-09-19T00:37:00"}]
[null,null,"Expérience",null,null,null,null,null,null,null,null,null,null,null,null,null,null,null,null,null,null,null,"2h53",null,null,null,null,null,"flèche arcane pour compenser","A1",0,null,40,7,null,13,null,null,null,null,-12,-1,null,-3,null,null,null,null,null,null,null,null,null,null,null,0,61,35,0,10,0,8,4,2021,{"$f":"BM12+BL12","v":30006},{"$f":"BN12+3.75/24","v":"2010-09-19T04:22:00"},{"$f":"BO1*($BN13-$BW$5)+BO5","v":-164.68710532416299},{"$f":"BP1*($BN13-$BW$5)+BP5","v":-164.68710532416299},-116.66148611117387,0,-92.246114583380404,0,0,0]
[null,null,"Attaquant",null,"Défenseur",null,null,null,null,null,null,null,null,null,null,null,null,null,null,null,null,null,null,null,null,null,null,null,null,"C1",7,null,null,null,null,17,null,7,null,null,null,null,null,-5,null,-1,null,null,null,null,null,null,null,null,null,0,61,35,0,5,0,7,4,2159,{"$f":"BM13+BL13","v":32027}]
[null,null,0.67100000000000004,"Honneur","/",null,null,"Avec flèche des arcanes",null,null,null,null,null,null,null,null,null,null,null,null,null,null,null,null,null,null,null,null,null,"E1",44,null,84,43,null,18,null,null,null,null,null,-12,null,-5,null,null,null,null,null,null,null,null,null,null,null,0,61,23,0,0,0,7,4,2516,{"$f":"BM14+BL14","v":34186}]
[null,null,"1 356","Expérience de base","/",null,null,null,null,null,null,null,null,null,null,null,null,null,null,null,null,null,null,null,null,null,null,null,null,"A5",15,null,30,26,null,19,null,null,null,null,-6,-7,null,-5,null,null,null,null,null,null,null,7,null,null,null,0,55,16,0,2,0,7,4,2551,{"$f":"BM15+BL15","v":36702}]
[null,null,0.67100000000000004,"Modificateur total","/"]
[null,null,"2 266","Expérience totale","/"]
[]
[null,null,"Pertes définitives",null,null,null,null,null,null,null,null,null,null,null,null,null,null,null,null,null,null,null,null,null,null,null,null,null,null,null,null,null,null,null,null,null,null,null,null,null,null,null,null,null,null,null,null,null,null,null,null,null,null,null,null,null,null,null,"Heureusement que j'avais la baraque à rang 3"]
[null,null,"Attaquant",null,null,null,null,null,null,null,"Défenseur",null,null,null,null,null,null,null,null,null,null,null,null,null,null,null,null,null,null,null,null,null,null,null,null,null,null,null,null,null,null,null,null,null,null,null,null,null,null,null,null,null,null,null,null,null,null,null,"Mais,… je n'avais pas la magie :("]
[null,null,"Unité","Effectif",null,"Puissance",null,"Cout en or","Cout en rares","Peloton","Unité","Effectif",null,"Puissance",null,"Cout en or","Cout en rares"]
[null,null,null,"Initial","Perdu","Initiale","Perdue","des pertes","des pertes",null,null,"Initial","Perdu","Initiale","Perdue","des pertes","des pertes"]
[null,null,"Chien des enfers",18,5,"6 660","1 850","4 200","—",1,"Titan",1,1,"8 190","8 190","—",14]
[null,null,"Démon cornu",41,12,"6 683","1 956","4 788","—",2,"Ingénieur gremlin",83,83,"7 138","7 138","18 758","—",null,"A","B","C","D","E"]
[null,null,null,null,null,null,null,null,null,3,"Djinn",3,3,"3 951","3 951","2 700",6]
[null,null,null,59,17,"13 343","3 806","8 988","—","Total",null,87,87,"19 279","19 279","21 458",20]
[null,null,"Expérience"]
[null,null,"Attaquant",null,"Défenseur",null,null,null,null,null,null,null,null,null,null,null,null,null,null,null,null,null,"O"]
[null,null,0.44490000000000002,"Honneur","/"]
[null,null,"1 624","Expérience de base","/"]
[null,null,0.44490000000000002,"Modificateur total","/"]
[null,null,"2 347","Expérience totale","/"]
[]
[]
[null,null,"Pertes définitives"]
[null,null,"Attaquant",null,null,null,null,null,null,null,"Défenseur"]
[null,null,"Unité","Effectif",null,"Puissance",null,"Cout en or","Cout en rares","Peloton","Unité","Effectif",null,"Puissance",null,"Cout en or","Cout en rares",null,"A","B","C","D","E"]
[null,null,null,"Initial","Perdu","Initiale","Perdue","des pertes","des pertes",null,null,"Initial","Perdu","Initiale","Perdue","des pertes","des pertes",null,null,null,null,null,null,1]
[null,null,"Succube",3,1,"2 754",918,"1 848","—",1,"Conscrit",67,67,"8 576","8 576","18 559","—",null,null,null,null,null,null,2]
[null,null,"Familier",50,14,"4 300","1 204","3 164","—",2,"Paysan",32,32,"3 104","3 104","7 040","—",null,null,null,null,null,null,3]
[null,null,null,53,15,"7 054","2 122","5 012","—","Total",null,99,99,"11 680","11 680","25 599","—",null,null,null,null,null,null,4]
[null,null,"Expérience",null,null,null,null,null,null,null,null,null,null,null,null,null,null,null,null,null,null,null,null,5]
[null,null,"Attaquant",null,"Défenseur"]
[null,null,0.65580000000000005,"Honneur","/"]
[null,null,779,"Expérience de base","/"]
[null,null,0.65580000000000005,"Modificateur total","/"]
[null,null,"1 289","Expérience totale","/"]
[]
[]
[null,null,"Pertes définitives",null,null,null,null,null,null,null,null,null,null,null,null,null,null,null,"Avec sortilège +200XP",null,null,null,null,null,null,null,null,null,null,null,{"$f":"360/3","v":120}]
[null,null,"Attaquant",null,null,null,null,null,null,null,"Défenseur"]
[null,null,"Unité","Effectif",null,"Puissance",null,"Cout en or","Cout en rares","Peloton","Unité","Effectif",null,"Puissance",null,"Cout en or","Cout en rares",null,"A","B","C","D","E"]
[null,null,null,"Initial","Perdu","Initiale","Perdue","des pertes","des pertes",null,null,"Initial","Perdu","Initiale","Perdue","des pertes","des pertes",null,null,null,null,"O",null,1]
[null,null,"SuccubeSuccube",6,1,"5 508",918,"1 848","—",1,"Démon gardien",23,23,"4 508","4 508","10 994","—",null,null,null,null,null,null,2]
[null,null,null,null,null,null,null,null,null,2,"Cheval infernal",1,1,"1 795","1 795","1 100","soufre 2",null,null,null,null,null,null,3]
[null,null,null,null,null,null,null,null,null,3,"Maitresse succube",1,1,"1 101","1 101","2 217","—",null,null,null,null,null,null,4]
[null,null,null,null,null,null,null,null,null,4,"Succube",1,1,918,918,"1 848","—",null,null,null,null,null,null,5]
[null,null,null,6,1,"5 508",918,"1 848","—","Total",null,26,26,"8 322","8 322","16 159",2]
[null,null,"Expérience"]
[null,null,"Attaquant",null,"Défenseur"]
[null,null,0.51090000000000002,"Honneur","/"]
[null,null,618,"Expérience de base","/"]
[null,null,0.51090000000000002,"Modificateur total","/"]
[null,null,934,"Expérience totale","/"]
[]
[]
[null,null,"Pertes définitives"]
[null,null,"Attaquant",null,null,null,null,null,null,null,"Défenseur"]
[null,null,"Unité","Effectif",null,"Puissance",null,"Cout en or","Cout en rares","Peloton","Unité","Effectif",null,"Puissance",null,"Cout en or","Cout en rares",null,null,null,"A5"]
[null,null,null,"Initial","Perdu","Initiale","Perdue","des pertes","des pertes",null,null,"Initial","Perdu","Initiale","Perdue","des pertes","des pertes"]
[null,null,"Démon cornu",26,7,"4 238","1 141","2 793","—",1,"Gargouille de pierre",65,65,"7 800","7 800","22 230","—",null,"A","B","C","D","E"]
[null,null,"Chien des enfers",19,5,"7 030","1 850","4 200","—",2,"Archimage",9,9,"7 281","7 281","17 100","—",null,null,null,null,null,null,1]
[null,null,"Familier",30,6,"2 580",516,"1 356","—",3,"Gargouille d'obsidienne",26,26,"3 744","3 744","10 660","—",null,null,null,null,null,null,2]
[null,null,null,null,null,null,null,null,null,4,"Raja Rakshasa",1,1,"2 950","2 950","2 300",4,null,null,null,null,null,null,3]
[null,null,null,75,18,"13 848","3 507","8 349","—","Total",null,101,101,"21 775","21 775","52 290",4,null,null,null,null,null,null,4]
[null,null,"Expérience",null,null,null,null,null,null,null,null,null,null,null,null,null,null,null,null,null,null,null,null,5]
[null,null,"Attaquant",null,"Défenseur"]
[null,null,0.57240000000000002,"Honneur","/"]
[null,null,"1 622","Expérience de base","/",null,null,null,"Héros Niveau 9"]
[null,null,0.57240000000000002,"Modificateur total","/"]
[null,null,"2 551","Expérience totale","/"]
[]
[null,null,"Pertes définitives"]
[null,null,"Attaquant",null,null,null,null,null,null,null,"Défenseur",null,null,null,null,null,null,null,null,null,"D5",null,"3h36mn14"]
[null,null,"Unité","Effectif",null,"Puissance",null,"Cout en or","Cout en rares","Peloton","Unité","Effectif",null,"Puissance",null,"Cout en or","Cout en rares"]
[null,null,null,"Initial","Perdu","Initiale","Perdue","des pertes","des pertes",null,null,"Initial","Perdu","Initiale","Perdue","des pertes","des pertes",null,"A","B","C","D","E"]
[null,null,"Démon cornu",36,10,"5 868","1 630","3 990","—",1,"Dragon d'émeraude",1,1,"9 077","9 077","—",14,null,null,null,null,null,null,1]
[null,null,"Chien des enfers",14,3,"5 180","1 110","2 520","—",2,"Druide séculaire",4,4,"4 404","4 404","8 872","—",null,null,null,null,null,null,2]
[null,null,null,null,null,null,null,null,null,3,"Fine-lame",17,17,"2 771","2 771","6 783","—",null,null,null,null,null,null,3]
[null,null,null,50,13,"11 048","2 740","6 510","—","Total",null,22,22,"16 252","16 252","15 655",14,null,null,null,null,null,null,4]
[null,null,"Expérience",null,null,null,null,null,null,null,null,null,null,null,null,null,null,null,null,null,null,null,null,5]
[null,null,"Attaquant",null,"Défenseur"]
[null,null,0.47099999999999997,"Honneur","/"]
[null,null,"1 459","Expérience de base","/"]
[null,null,0.47099999999999997,"Modificateur total","/"]
[null,null,"2 147","Expérience totale","/"]
[]
[]
[null,null,"Pertes définitives",null,null,null,null,null,null,null,null,null,null,null,null,null,null,null,null,"3h20mn5s"]
[null,null,"Attaquant",null,null,null,null,null,null,null,"Défenseur",null,null,null,null,null,null,null,null,null,"C5"]
[null,null,"Unité","Effectif",null,"Puissance",null,"Cout en or","Cout en rares","Peloton","Unité","Effectif",null,"Puissance",null,"Cout en or","Cout en rares"]
[null,null,null,"Initial","Perdu","Initiale","Perdue","des pertes","des pertes",null,null,"Initial","Perdu","Initiale","Perdue","des pertes","des pertes",null,"A","B","C","D","E"]
[null,null,"Succube",10,2,"9 180","1 836","3 696","—",1,"Fine-lame",70,70,"11 410","11 410","27 930","—",null,null,null,null,null,null,1]
[null,null,null,null,null,null,null,null,null,2,"Druide séculaire",3,3,"3 303","3 303","6 654","—",null,null,null,null,null,null,2]
[null,null,null,10,2,"9 180","1 836","3 696","—","Total",null,73,73,"14 713","14 713","34 584","—",null,null,null,null,null,null,3]
[null,null,"Expérience",null,null,null,null,null,null,null,null,null,null,null,null,null,null,null,null,null,null,null,null,4]
[null,null,"Attaquant",null,"Défenseur",null,null,null,null,null,null,null,null,null,null,null,null,null,null,null,null,null,null,5]
[null,null,0.60270000000000001,"Honneur","/"]
[null,null,"1 036","Expérience de base","/"]
[null,null,0.60270000000000001,"Modificateur total","/"]
[null,null,"1 660","Expérience totale","/"]
[]
[null,null,"Pertes définitives"]
[null,null,"Attaquant",null,null,null,null,null,null,null,"Défenseur",null,null,null,null,null,null,null,null,null,"A4"]
[null,null,"Unité","Effectif",null,"Puissance",null,"Cout en or","Cout en rares","Peloton","Unité","Effectif",null,"Puissance",null,"Cout en or","Cout en rares"]
[null,null,null,"Initial","Perdu","Initiale","Perdue","des pertes","des pertes",null,null,"Initial","Perdu","Initiale","Perdue","des pertes","des pertes",null,"A","B","C","D","E"]
[null,null,"Démon cornu",36,10,"5 868","1 630","3 990","—",1,"Dragon d'émeraude",1,1,"9 077","9 077","—",14,null,null,null,null,null,null,1]
[null,null,"Familier",24,7,"2 064",602,"1 582","—",2,"Maitre chasseur",14,14,"7 532","7 532","15 526","—",null,null,null,null,null,null,2]
[null,null,"Chien des enfers",18,5,"6 660","1 850","4 200","—",3,"Licorne",3,3,"5 127","5 127","3 300",6,null,null,null,null,null,null,3]
[null,null,null,78,22,"14 592","4 082","9 772","—","Total",null,18,18,"21 736","21 736","18 826",20,null,null,null,null,null,null,4]
[null,null,"Expérience",null,null,null,null,null,null,null,null,null,null,null,null,null,null,null,null,null,null,null,null,5]
[null,null,"Attaquant",null,"Défenseur"]
[null,null,0.48959999999999998,"Honneur","/"]
[null,null,"1 837","Expérience de base","/"]
[null,null,0.48959999999999998,"Modificateur total","/"]
[null,null,"2 736","Expérience totale","/"]
[]
[null,null,"Pertes définitives"]
[null,null,"Attaquant",null,null,null,null,null,null,null,"Défenseur",null,null,null,null,null,null,null,null,null,"A1"]
[null,null,"Unité","Effectif",null,"Puissance",null,"Cout en or","Cout en rares","Peloton","Unité","Effectif",null,"Puissance",null,"Cout en or","Cout en rares"]
[null,null,null,"Initial","Perdu","Initiale","Perdue","des pertes","des pertes",null,null,"Initial","Perdu","Initiale","Perdue","des pertes","des pertes",null,"A","B","C","D","E"]
[null,null,"Chien des enfers",13,3,"4 810","1 110","2 520","—",1,"Druide",10,10,"9 180","9 180","18 480","—",null,null,null,null,null,null,1]
[null,null,"Familier",40,12,"3 440","1 032","2 712","—",2,"Tréant",1,1,"2 652","2 652","2 200",3,null,null,null,null,null,null,2]
[null,null,"Démon cornu",7,1,"1 141",163,399,"—",3,"Druide séculaire",2,2,"2 202","2 202","4 436","—",null,null,null,null,null,null,3]
[null,null,null,null,null,null,null,null,null,4,"Licorne",1,1,"1 709","1 709","1 100",2,null,null,null,null,null,null,4]
[null,null,null,60,16,"9 391","2 305","5 631","—","Total",null,14,14,"15 743","15 743","26 216",5,null,null,null,null,null,null,5]
[null,null,"Expérience"]
[null,null,"Attaquant",null,"Défenseur",null,null,null,"Magicien dérangé niveau 11"]
[null,null,0.6764,"Honneur","/",null,null,null,"Flèche des arcanes Tour 1"]
[null,null,"1 312","Expérience de base","/"]
[null,null,0.6764,"Modificateur total","/"]
[null,null,"2 199","Expérience totale","/"]
[]
[null,null,"Pertes définitives"]
[null,null,"Attaquant",null,null,null,null,null,null,null,"Défenseur",null,null,null,null,null,null,null,null,null,"C1"]
[null,null,"Unité","Effectif",null,"Puissance",null,"Cout en or","Cout en rares","Peloton","Unité","Effectif",null,"Puissance",null,"Cout en or","Cout en rares"]
[null,null,null,"Initial","Perdu","Initiale","Perdue","des pertes","des pertes",null,null,"Initial","Perdu","Initiale","Perdue","des pertes","des pertes",null,"A","B","C","D","E"]
[null,null,"Chien des enfers",17,5,"6 290","1 850","4 200","—",1,"Inquisiteur",4,4,"10 300","10 300","6 800",12,null,null,null,null,null,null,1]
[null,null,"Succube",7,1,"6 426",918,"1 848","—",2,"Ange",1,1,"7 150","7 150","—",10,null,null,null,null,null,null,2]
[null,null,null,24,6,"12 716","2 768","6 048","—","Total",null,5,5,"17 450","17 450","6 800",22,null,null,null,null,null,null,3]
[null,null,"Expérience",null,null,null,null,null,null,null,null,null,null,null,null,null,null,null,null,null,null,null,null,4]
[null,null,"Attaquant",null,"Défenseur",null,null,null,null,null,null,null,null,null,null,null,null,null,null,null,null,null,null,5]
[null,null,0.37230000000000002,"Honneur","/"]
[null,null,"1 573","Expérience de base","/"]
[null,null,0.37230000000000002,"Modificateur total","/"]
[null,null,"2 159","Expérience totale","/"]
[]
[]
[null,null,"Pertes définitives"]
[null,null,"Attaquant",null,null,null,null,null,null,null,"Défenseur",null,null,null,null,null,null,null,null,null,"E1"]
[null,null,"Unité","Effectif",null,"Puissance",null,"Cout en or","Cout en rares","Peloton","Unité","Effectif",null,"Puissance",null,"Cout en or","Cout en rares"]
[null,null,null,"Initial","Perdu","Initiale","Perdue","des pertes","des pertes",null,null,"Initial","Perdu","Initiale","Perdue","des pertes","des pertes",null,"A","B","C","D","E"]
[null,null,"Démon cornu",33,9,5379,1467,3591,"—",1,"Dragon spectral",1,1,8213,8213,"—",14,null,null,null,null,null,null,1]
[null,null,"Chien des enfers",18,5,6660,1850,4200,"—",2,"Archer squelette",105,105,7350,7350,21525,"—",null,null,null,null,null,null,2]
[null,null,"Démon cornu",10,3,1630,489,1197,"—",3,"Fantôme",19,19,5757,5757,14440,"—",null,null,null,null,null,null,3]
[null,null,"Familier",84,13,7224,1118,2938,"—",4,"Liche",3,3,4290,4290,3000,6,null,null,null,null,null,null,4]
[null,null,null,145,30,20893,4924,11926,"—","Total",null,128,128,25610,25610,38965,20,null,null,null,null,null,null,5]
[null,null,"Expérience"]
[null,null,"Attaquant",null,"Défenseur"]
[null,null,0.2258,"Honneur","/"]
[null,null,2053,"Expérience de base","/"]
[null,null,0.2258,"Modificateur total","/"]
[null,null,2516,"Expérience totale","/"]
[]
[]
[]
[]
[]
[]
[]
[]
[null,null,"Pertes définitives"]
[null,null,"Attaquant",null,null,null,null,null,null,null,"Défenseur"]
[null,null,"Unité","Effectif",null,"Puissance",null,"Cout en or","Cout en rares","Peloton","Unité","Effectif",null,"Puissance",null,"Cout en or","Cout en rares"]
[null,null,null,"Initial","Perdu","Initiale","Perdue","des pertes","des pertes",null,null,"Initial","Perdu","Initiale","Perdue","des pertes","des pertes"]
[null,null,"Démon cornu",34,10,"5 542","1 630","3 990","—",1,"Dragon spectral",1,1,"8 213","8 213","—",14]
[null,null,"Chien des enfers",13,3,"4 810","1 110","2 520","—",2,"Archer squelette",105,105,"7 350","7 350","21 525","—"]
[null,null,"Démon cornu",24,7,"3 912","1 141","2 793","—",3,"Fantôme",19,19,"5 757","5 757","14 440","—"]
[null,null,"Chien des enfers",8,2,"2 960",740,"1 680","—",4,"Liche",3,3,"4 290","4 290","3 000",6]
[null,null,null,79,22,"17 224","4 621","10 983","—","Total",null,128,128,"25 610","25 610","38 965",20]
[null,null,"Expérience"]
[null,null,"Attaquant",null,"Défenseur"]
[null,null,0.4869,"Honneur","/"]
[null,null,"2 053","Expérience de base","/"]
[null,null,0.4869,"Modificateur total","/"]
[null,null,"3 052","Expérience totale","/"]

{"sheet":"TR2","index":15,"n_rows":172,"n_cols":74,"rows_kept":172,"cut":false,"hidden":false,"merged":[[115,9,116,9],[115,10,116,10],[115,11,115,12],[99,13,99,14],[106,2,106,4],[99,2,100,2],[99,3,99,4],[99,5,99,6],[99,9,100,9],[99,10,100,10],[99,11,99,12],[113,2,113,16],[114,10,114,16],[115,13,115,14],[103,2,103,8],[104,2,104,8],[4,10,5,10],[4,11,4,12],[4,13,4,14],[10,2,10,4],[159,11,159,12],[159,13,159,14],[166,2,166,4],[2,2,2,16],[3,2,3,8],[3,10,3,16],[4,2,5,2],[4,3,4,4],[4,5,4,6],[4,9,5,9],[144,13,144,14],[157,2,157,16],[158,2,158,8],[158,10,158,16],[159,2,160,2],[159,3,159,4],[159,5,159,6],[159,9,160,9],[159,10,160,10],[144,2,145,2],[17,2,17,16],[18,2,18,8],[18,10,18,16],[19,2,20,2],[19,3,19,4],[19,5,19,6],[19,9,20,9],[19,10,20,10],[37,11,37,12],[37,13,37,14],[25,2,25,8],[27,2,27,4],[35,2,35,16],[36,2,36,8],[36,10,36,16],[37,2,38,2],[37,3,37,4],[37,5,37,6],[37,9,38,9],[37,10,38,10],[52,10,53,10],[52,11,52,12],[19,11,19,12],[19,13,19,14],[22,2,22,8],[23,2,23,8],[24,2,24,8],[43,2,43,4],[69,13,69,14],[69,11,69,12],[67,2,67,16],[68,2,68,8],[68,10,68,16],[50,2,50,16],[51,2,51,8],[51,10,51,16],[52,2,53,2],[58,2,58,8],[60,2,60,4],[52,13,52,14],[52,3,52,4],[52,5,52,6],[52,9,53,9],[74,2,74,8],[76,2,76,4],[83,2,83,16],[84,2,84,8],[84,10,84,16],[69,2,70,2],[69,3,69,4],[69,5,69,6],[69,9,70,9],[69,10,70,10],[85,13,85,14],[97,2,97,16],[98,2,98,8],[98,10,98,16],[85,2,86,2],[85,3,85,4],[85,5,85,6],[85,9,86,9],[85,10,86,10],[85,11,85,12],[88,2,88,8],[90,2,90,4],[150,2,150,4],[164,2,164,8],[133,2,133,8],[135,2,135,4],[114,2,114,8],[115,2,116,2],[115,3,115,4],[115,5,115,6],[144,3,144,4],[144,5,144,6],[129,3,129,4],[129,5,129,6],[144,9,145,9],[144,10,145,10],[144,11,144,12],[129,11,129,12],[129,13,129,14],[142,2,142,16],[143,2,143,8],[143,10,143,16],[120,2,120,4],[127,2,127,16],[128,2,128,8],[128,10,128,16],[129,2,130,2],[129,9,130,9],[129,10,130,10]]}
[null,null,null,null,null,null,null,null,null,null,null,null,null,null,null,null,null,null,null,null,null,null,null,null,null,null,"LANCER LES COMBATS EN //",null,null,null,null,null,null,null,"OPTIMISER LES XP",null,null,null,null,null,null,null,null,null,null,null,null,null,null,null,null,null,null,null,null,null,null,null,null,null,null,null,null,null,null,null,null,null,null,null,null,null,null,"Accroissement"]
[]
[null,null,"Pertes définitives",null,null,null,null,null,null,null,null,null,null,null,null,null,null,null,null,null,null,null,null,null,null,null,null,null,null,null,null,null,"ENGAGES/BESOINS",null,null,null,null,null,null,null,"PERTES/GAINS",null,null,null,null,null,null,null,"ACHATS/BESOINS SUP.",null,null,null,null,null,null,null,"TOTAL DISPONIBLES",null,null,null,null,null,null,null,null,null,null,"RESERVES",null,null,null,null,null,"Maintenant"]
[null,null,"Attaquant",null,null,null,null,null,null,null,"Défenseur",null,null,null,null,null,null,null,null,null,"A1",null,null,null,null,null,null,null,null,null," ","Famillier","Démon cornu"," ","Chien des enfers"," ","Succube",null," ","Famillier","Démon cornu"," ","Chien des enfers"," ","Succube",null," ","Famillier","Démon cornu"," ","Chien des enfers"," ","Succube",null," ","Famillier","Démon cornu"," ","Chien des enfers"," ","Succube",null,null,null,"Fin"," ","Famillier","Démon cornu"," ","Chien des enfers"," ","Succube",null,{"$f":"NOW()","v":"2010-09-29T23:41:22.700"}]
[null,null,"Unité","Effectif",null,"Puissance",null,"Cout en or","Cout en rares","Peloton","Unité","Effectif",null,"Puissance",null,"Cout en or","Cout en rares",null,null,null,null,null,null,null,null,null,"Qx","Héros","Pos","Manque","T1","T1+","T2","T2+","T3","T3+","T4","T4+","T1","T1+","T2","T2+","T3","T3+","T4","T4+","T1","T1+","T2","T2+","T3","T3+","T4","T4+","T1","T1+","T2","T2+","T3","T3+","T4","T4+","XP","Total XP","Date Heure","T1","T1+","T2","T2+","T3","T3+","T4","T4+"]
[null,null,null,"Initial","Perdu","Initiale","Perdue","des pertes","des pertes",null,null,"Initial","Perdu","Initiale","Perdue","des pertes","des pertes",null,"A","B","C","D","E",null,null,null,null,null,null,null,null,null,null,null,null,null,null,null,null,null,null,null,null,null,null,null,null,null,null,null,null,null,null,null,null,64,37,null,16,null,6,null,null,9838,null,17,17,12,null,9]
[null,null,"Chien des enfers",13,3,"4 810","1 110","2 520","—",1,"Gremlin",113,113,"8 023","8 023","21 357","—",null,null,null,null,null,null,1,null,{"$f":"ABS(BK7/SUM(AM7:AT7))","v":68.060606060606062},null,"exp. 6","E4",{"$f":"IF(AE7<=BC6+AU7,0,AE7-(BC6+AU7))+IF(AF7<=BD6+AV7,0,AF7-(BD6+AV7))+IF(AG7<=BE6+AW7,0,AG7-(BE6+AW7))+IF(AH7<=BF6+AX7,0,AH7-(BF6+AX7))+IF(AI7<=BG6+AY7,0,AI7-(BG6+AY7))+IF(AJ7<=BH6+AZ7,0,AJ7-(BH6+AZ7))+IF(AK7<=BI6+BA7,0,AK7-(BI6+BA7))+IF(AL7<=BJ6+BB7,0,AL7-(BJ6+BB7))","v":42},null,72,null,42,null,null,null,null,null,-21,-12,null,null,null,null,null,null,8,5,null,null,null,null,null,{"$f":"BC6+AM7+AU7","v":0},{"$f":"BD6+AN7+AV7","v":51},{"$f":"BE6+AO7+AW7","v":30},{"$f":"BF6+AP7+AX7","v":0},{"$f":"BG6+AQ7+AY7","v":16},{"$f":"BH6+AR7+AZ7","v":0},{"$f":"BI6+AS7+BA7","v":6},{"$f":"BJ6+AT7+BB7","v":0},2246,{"$f":"BL6+BK7","v":12084}]
[null,null,"Familier",22,6,"1 892",516,"1 356","—",2,"Golem d'acier",9,9,"2 943","2 943","7 776","—",null,null,null,null,null,null,2,null,{"$f":"ABS(BK8/SUM(AM8:AT8))","v":115.90625},null,"exp. 6","E1",{"$f":"IF(AE8<=BC7+AU8,0,AE8-(BC7+AU8))+IF(AF8<=BD7+AV8,0,AF8-(BD7+AV8))+IF(AG8<=BE7+AW8,0,AG8-(BE7+AW8))+IF(AH8<=BF7+AX8,0,AH8-(BF7+AX8))+IF(AI8<=BG7+AY8,0,AI8-(BG7+AY8))+IF(AJ8<=BH7+AZ8,0,AJ8-(BH7+AZ8))+IF(AK8<=BI7+BA8,0,AK8-(BI7+BA8))+IF(AL8<=BJ7+BB8,0,AL8-(BJ7+BB8))","v":33},null,72,null,33,6,null,6,null,null,-21,-9,null,-1,null,-1,null,null,21,null,null,null,null,null,null,0,51,21,0,15,0,5,0,3709,{"$f":"BL7+BK8","v":15793}]
[null,null,"Démon cornu",11,3,"1 793",489,"1 197","—",3,"Djinn",2,2,"2 634","2 634","1 800",4,null,null,null,null,null,null,3,null,84.84615384615384,null,"exp. 6","D1",{"$f":"IF(AE9<=BC8+AU9,0,AE9-(BC8+AU9))+IF(AF9<=BD8+AV9,0,AF9-(BD8+AV9))+IF(AG9<=BE8+AW9,0,AG9-(BE8+AW9))+IF(AH9<=BF8+AX9,0,AH9-(BF8+AX9))+IF(AI9<=BG8+AY9,0,AI9-(BG8+AY9))+IF(AJ9<=BH8+AZ9,0,AJ9-(BH8+AZ9))+IF(AK9<=BI8+BA9,0,AK9-(BI8+BA9))+IF(AL9<=BJ8+BB9,0,AL9-(BJ8+BB9))","v":39},null,61,null,29,null,null,2,null,null,-18,-8,null,null,null,null,null,null,null,null,null,null,null,null,null,0,33,13,0,15,0,5,0,2206,17999]
[null,null,null,46,12,"8 495","2 115","5 073","—","Total",null,124,124,"13 600","13 600","30 933",4,null,null,null,null,null,null,4,null,260.18181818181819,null,"exp. 6","A4",{"$f":"IF(AE10<=BC9+AU10,0,AE10-(BC9+AU10))+IF(AF10<=BD9+AV10,0,AF10-(BD9+AV10))+IF(AG10<=BE9+AW10,0,AG10-(BE9+AW10))+IF(AH10<=BF9+AX10,0,AH10-(BF9+AX10))+IF(AI10<=BG9+AY10,0,AI10-(BG9+AY10))+IF(AJ10<=BH9+AZ10,0,AJ10-(BH9+AZ10))+IF(AK10<=BI9+BA10,0,AK10-(BI9+BA10))+IF(AL10<=BJ9+BB10,0,AL10-(BJ9+BB10))","v":37},null,null,null,35,null,null,7,null,null,null,null,null,-10,null,-1,null,null,null,null,null,null,null,null,null,0,33,13,0,5,0,4,0,2862,20861]
[null,null,"Expérience",null,null,null,null,null,null,null,null,null,null,null,null,null,null,null,null,null,null,null,null,5,null,67.758620689655174,null,"ga. 4","C5",63,null,63,null,31,7,null,null,null,null,-18,-9,null,-2,null,null,null,null,null,null,null,null,null,null,null,0,15,4,0,3,0,4,0,1965,22826]
[null,null,"Attaquant",null,"Défenseur",null,null,null,null,null,null,null,null,null,null,null,null,null,null,null,null,null,null,null,null,76.25,null,"exp. 6","B5",67,null,59,null,21,5,null,null,null,null,-17,-6,null,-1,null,null,null,null,null,null,null,null,null,null,null,0,-2,-2,0,2,0,4,0,1830,24656]
[null,null,0.60089999999999999,"Honneur","/",null,null,null,"Niv. 6 Explorateur",null,null,null,null,null,null,null,null,null,null,null,null,null,null,null,null,380.5,"Q9","exp. 6","A1",48,null,22,null,11,13,null,null,null,null,-6,{"$f":"-3+5","v":2},null,-3,null,3,null,null,null,null,null,null,null,null,null,0,-8,0,0,-1,0,7,0,1522,{"$f":"BL12+BK17","v":26849}]
[null,null,951,"Expérience de base","/",null,null,null,"Fleche des arcanes  Tour 1",null,null,null,null,null,null,null,null,null,null,null,null,null,null,null,null,679.71428571428567,null,"exp. 6","B1",37,null,null,null,null,28,null,null,null,null,null,null,null,-7,null,null,null,null,null,null,null,null,null,null,null,0,-8,0,0,-8,0,7,0,4758,{"$f":"BL13+BK13","v":28371},null,{"$f":"BN6*($BM14-$BV$4)+#REF!","v":{"$error":"#REF!"}},{"$f":"BO6*($BM14-$BV$4)+#REF!","v":{"$error":"#REF!"}},{"$f":"BP6*($BM14-$BV$4)+#REF!","v":{"$error":"#REF!"}},{"$f":"BQ6*($BM14-$BV$4)+#REF!","v":{"$error":"#REF!"}},{"$f":"BR6*($BM14-$BV$4)+#REF!","v":{"$error":"#REF!"}},{"$f":"BS1*($BM14-$BV$4)+#REF!","v":{"$error":"#REF!"}},{"$f":"BT1*($BM14-$BV$4)+#REF!","v":{"$error":"#REF!"}},{"$f":"BU1*($BM14-$BV$4)+#REF!","v":{"$error":"#REF!"}}]
[null,null,0.60089999999999999,"Modificateur total","/",null,null,null,null,null,null,null,null,null,null,null,null,null,null,null,null,null,null,null,null,124.9375,null,"exp. 6","A2",{"$f":"IF(AE15<=BC14+AU15,0,AE15-(BC14+AU15))+IF(AF15<=BD14+AV15,0,AF15-(BD14+AV15))+IF(AG15<=BE14+AW15,0,AG15-(BE14+AW15))+IF(AH15<=BF14+AX15,0,AH15-(BF14+AX15))+IF(AI15<=BG14+AY15,0,AI15-(BG14+AY15))+IF(AJ15<=BH14+AZ15,0,AJ15-(BH14+AZ15))+IF(AK15<=BI14+BA15,0,AK15-(BI14+BA15))+IF(AL15<=BJ14+BB15,0,AL15-(BJ14+BB15))","v":67},null,null,null,37,14,null,3,null,null,null,-11,null,-4,null,-1,null,null,null,null,null,null,null,null,null,0,-8,-11,0,-12,0,6,0,1999,{"$f":"BL14+BK14","v":33129}]
[null,null,"1 522","Expérience totale","/",null,null,null,null,null,null,null,null,null,null,null,null,null,null,null,null,null,null,null,null,179.1875,null,"exp. 6","E2",{"$f":"IF(AE16<=BC15+AU16,0,AE16-(BC15+AU16))+IF(AF16<=BD15+AV16,0,AF16-(BD15+AV16))+IF(AG16<=BE15+AW16,0,AG16-(BE15+AW16))+IF(AH16<=BF15+AX16,0,AH16-(BF15+AX16))+IF(AI16<=BG15+AY16,0,AI16-(BG15+AY16))+IF(AJ16<=BH15+AZ16,0,AJ16-(BH15+AZ16))+IF(AK16<=BI15+BA16,0,AK16-(BI15+BA16))+IF(AL16<=BJ15+BB16,0,AL16-(BJ15+BB16))","v":90},null,null,null,59,null,null,null,null,null,null,-16,null,null,null,null,null,null,null,null,null,null,null,null,null,0,-8,-27,0,-12,0,6,0,2867,{"$f":"BL15+BK15","v":35128}]
[null,null,null,null,null,null,null,null,null,null,null,null,null,null,null,null,null,null,null,null,null,null,null,null,null,365.5,null,"exp. 6","E3",65,null,null,null,null,18,null,6,null,null,null,null,null,-5,null,-1,null,null,null,null,null,null,null,null,null,0,-8,-27,0,-17,0,5,0,2193,{"$f":"BL16+BK16","v":37995}]
[null,null,"Pertes définitives"]
[null,null,"Attaquant",null,null,null,null,null,null,null,"Défenseur",null,null,null,null,null,null,null,null,null,null,null,null,null,null,null,null,null,null,"Plus gros combats d'abord ?",null,null,null,null,null,null,null,null,null,null,null,null,null,null,"Il est possible d'économiser les succubes assez facilement"]
[null,null,"Unité","Effectif",null,"Puissance",null,"Cout en or","Cout en rares","Peloton","Unité","Effectif",null,"Puissance",null,"Cout en or","Cout en rares",null,null,null,null,null,null,null,null,null,null,null,null,"s",null,null,null,null,null,null,null,null,null,null,null,null,null,null,null,null,null,null,null,null,null,null,null,null,null,null,null,"Heureusement que j'avais la baraque à rang 3"]
[null,null,null,"Initial","Perdu","Initiale","Perdue","des pertes","des pertes",null,null,"Initial","Perdu","Initiale","Perdue","des pertes","des pertes",null,null,null,"B1",null,null,null,null,null,null,null,null,null,null,null,null,null,null,null,null,null,null,null,null,null,null,null,null,null,null,null,null,null,null,null,null,null,null,null,null,"Mais,… je n'avais pas la magie :("]
[null,null,"Chien des enfers",28,7,"10 360","2 590","5 880","—",1,"Ingénieur gremlin",101,101,"8 686","8 686","22 826","—",null,null,null,null,null,null,null,null,null,null,null,null,"Pas à fond. Economiser 3/4 créatures / max",null,null,null,null,null,null,null,null,null,null,null,"CONSTRUIRE LE CHENIL ASAP"]
[null,null,null,null,null,null,null,null,null,2,"Titan",1,1,"8 190","8 190","—",14,null,"A","B","C","D","E"]
[null,null,null,null,null,null,null,null,null,3,"Mage",5,5,"3 370","3 370","7 920","—",null,null,null,null,null,null,1]
[null,null,null,null,null,null,null,null,null,4,"Gremlin",44,44,"3 124","3 124","8 316","—",null,null,null,null,null,null,2,null,null,null,null,null,null,null,null,null,9,"Utilisez la puissance de la magie "]
[null,null,null,null,null,null,null,null,null,5,"Djinn",1,1,"1 317","1 317",900,2,null,null,null,null,null,null,3,null,null,null,null,null,null,null,null,null,10,"Massacre héroïque"]
[null,null,null,28,7,"10 360","2 590","5 880","—","Total",null,152,152,"24 687","24 687","39 962",16,null,null,null,null,null,null,4,null,null,null,null,null,null,null,null,null,11,"Gagner un combat en utilisant un objet magique"]
[null,null,"Expérience",null,null,null,null,null,null,null,null,null,null,null,null,null,null,null,null,null,null,null,null,5]
[null,null,"Attaquant",null,"Défenseur"]
[null,null,1.3829,"Honneur","/"]
[null,null,"1 997","Expérience de base","/"]
[null,null,1.3829,"Modificateur total","/"]
[null,null,"4 758","Expérience totale","/"]
[]
[]
[null,null,"Pertes définitives",null,null,null,null,null,null,null,null,null,null,null,null,null,null,null,null,null,"D1"]
[null,null,"Attaquant",null,null,null,null,null,null,null,"Défenseur"]
[null,null,"Unité","Effectif",null,"Puissance",null,"Cout en or","Cout en rares","Peloton","Unité","Effectif",null,"Puissance",null,"Cout en or","Cout en rares",null,"A","B","C","D","E"]
[null,null,null,"Initial","Perdu","Initiale","Perdue","des pertes","des pertes",null,null,"Initial","Perdu","Initiale","Perdue","des pertes","des pertes",null,null,null,null,null,null,1]
[null,null,"Familier",64,19,"5 504","1 634","4 294","—",1,"Vampire",11,11,"8 261","8 261","18 392","—",null,null,null,null,null,null,2]
[null,null,"Démon cornu",25,7,"4 075","1 141","2 793","—",2,"Dragon squelette",1,1,"5 866","5 866","—",10,null,null,null,null,null,null,3]
[null,null,"Succube",3,1,"2 754",918,"1 848","—",3,"Apparition",1,1,"3 365","3 365","2 500",4,null,null,null,null,null,null,4]
[null,null,null,92,27,"12 333","3 693","8 935","—","Total",null,13,13,"17 492","17 492","20 892",14,null,null,null,null,null,null,5]
[null,null,"Expérience"]
[null,null,"Attaquant",null,"Défenseur"]
[null,null,0.41830000000000001,"Honneur","/"]
[null,null,"1 555","Expérience de base","/"]
[null,null,0.41830000000000001,"Modificateur total","/"]
[null,null,"2 206","Expérience totale","/"]
[]
[null,null,"Pertes définitives",null,null,null,null,null,null,null,null,null,null,null,null,null,null,null,null,null,"E1"]
[null,null,"Attaquant",null,null,null,null,null,null,null,"Défenseur"]
[null,null,"Unité","Effectif",null,"Puissance",null,"Cout en or","Cout en rares","Peloton","Unité","Effectif",null,"Puissance",null,"Cout en or","Cout en rares",null,"A","B","C","D","E"]
[null,null,null,"Initial","Perdu","Initiale","Perdue","des pertes","des pertes",null,null,"Initial","Perdu","Initiale","Perdue","des pertes","des pertes",null,null,null,null,null,null,1]
[null,null,"Familier",72,21,"6 192","1 806","4 746","—",1,"Archidiable",1,1,"9 555","9 555","—",14,null,null,null,null,null,null,2]
[null,null,"Succube",6,1,"5 508",918,"1 848","—",2,"Diablotin",120,120,"8 520","8 520","22 680","—",null,null,null,null,null,null,3]
[null,null,"Démon cornu",30,9,"4 890","1 467","3 591","—",3,"Chien des enfers",14,14,"5 180","5 180","11 760","—",null,null,null,null,null,null,4]
[null,null,"Chien des enfers",6,1,"2 220",370,840,"—",4,"Démon gardien",18,18,"3 528","3 528","8 604","—",null,null,null,null,null,null,5]
[null,null,null,null,null,null,null,null,null,5,"Maitresse succube",3,3,"3 303","3 303","6 651","—"]
[null,null,null,114,32,"18 810","4 561","11 025","—","Total",null,156,156,"30 086","30 086","49 695",14]
[null,null,"Expérience"]
[null,null,"Attaquant",null,"Défenseur"]
[null,null,0.59950000000000003,"Honneur","/"]
[null,null,"2 379","Expérience de base","/",null,null,"Flèche des arcanes Tour 6"]
[null,null,0.59950000000000003,"Modificateur total","/"]
[null,null,"3 806","Expérience totale","/"]
[]
[null,null,"Pertes définitives"]
[null,null,"Attaquant",null,null,null,null,null,null,null,"Défenseur"]
[null,null,"Unité","Effectif",null,"Puissance",null,"Cout en or","Cout en rares","Peloton","Unité","Effectif",null,"Puissance",null,"Cout en or","Cout en rares",null,null,null,"A2"]
[null,null,null,"Initial","Perdu","Initiale","Perdue","des pertes","des pertes",null,null,"Initial","Perdu","Initiale","Perdue","des pertes","des pertes"]
[null,null,"Démon cornu",37,11,"6 031","1 793","4 389","—",1,"Dragon spectral",1,1,"8 213","8 213","—",14,null,"A","B","C","D","E"]
[null,null,"Chien des enfers",14,4,"5 180","1 480","3 360","—",2,"Fantôme",15,15,"4 545","4 545","11 400","—",null,null,null,null,null,null,1]
[null,null,"Succube",3,1,"2 754",918,"1 848","—",3,"Zombie",31,31,"4 154","4 154","11 191","—",null,null,null,null,null,null,2]
[null,null,null,null,null,null,null,null,null,4,"Zombie pestilentiel",10,10,"1 600","1 600","4 330","—",null,null,null,null,null,null,3]
[null,null,null,54,16,"13 965","4 191","9 597","—","Total",null,57,57,"18 512","18 512","26 921",14,null,null,null,null,null,null,4]
[null,null,"Expérience",null,null,null,null,null,null,null,null,null,null,null,null,null,null,null,null,null,null,null,null,5]
[null,null,"Attaquant",null,"Défenseur"]
[null,null,0.3256,"Honneur","/"]
[null,null,"1 508","Expérience de base","/"]
[null,null,0.3256,"Modificateur total","/"]
[null,null,"1 999","Expérience totale","/"]
[]
[null,null,"Pertes définitives"]
[null,null,"Attaquant",null,null,null,null,null,null,null,"Défenseur",null,null,null,null,null,null,null,null,null,"E2"]
[null,null,"Unité","Effectif",null,"Puissance",null,"Cout en or","Cout en rares","Peloton","Unité","Effectif",null,"Puissance",null,"Cout en or","Cout en rares"]
[null,null,null,"Initial","Perdu","Initiale","Perdue","des pertes","des pertes",null,null,"Initial","Perdu","Initiale","Perdue","des pertes","des pertes",null,"A","B","C","D","E"]
[null,null,"Démon cornu",59,16,"9 617","2 608","6 384","—",1,"Dryade",86,86,"9 116","9 116","21 672","—",null,null,null,null,null,null,1]
[null,null,null,null,null,null,null,null,null,2,"Dragon d'émeraude",1,1,"9 077","9 077","—",14,null,null,null,null,null,null,2]
[null,null,null,59,16,"9 617","2 608","6 384","—","Total",null,87,87,"18 193","18 193","21 672",14,null,null,null,null,null,null,3]
[null,null,"Expérience",null,null,null,null,null,null,null,null,null,null,null,null,null,null,null,null,null,null,null,null,4]
[null,null,"Attaquant",null,"Défenseur",null,null,null,null,null,null,null,null,null,null,null,null,null,null,null,null,null,null,5]
[null,null,0.89180000000000004,"Honneur","/"]
[null,null,"1 515","Expérience de base","/"]
[null,null,0.89180000000000004,"Modificateur total","/"]
[null,null,"2 867","Expérience totale","/"]
[]
[null,null,"Pertes définitives"]
[null,null,"Attaquant",null,null,null,null,null,null,null,"Défenseur",null,null,null,null,null,null,null,null,null,"E3"]
[null,null,"Unité","Effectif",null,"Puissance",null,"Cout en or","Cout en rares","Peloton","Unité","Effectif",null,"Puissance",null,"Cout en or","Cout en rares"]
[null,null,null,"Initial","Perdu","Initiale","Perdue","des pertes","des pertes",null,null,"Initial","Perdu","Initiale","Perdue","des pertes","des pertes",null,"A","B","C","D","E"]
[null,null,"Chien des enfers",17,5,"6 290","1 850","4 200","—",1,"Titan",1,1,"8 190","8 190","—",14,null,null,null,null,null,null,1]
[null,null,"Succube",6,1,"5 508",918,"1 848","—",2,"Gremlin",73,73,"5 183","5 183","13 797","—",null,null,null,null,null,null,2]
[null,null,null,null,null,null,null,null,null,3,"Ingénieur gremlin",34,34,"2 924","2 924","7 684","—",null,null,null,null,null,null,3]
[null,null,null,null,null,null,null,null,null,4,"Djinn",1,1,"1 317","1 317",900,2,null,null,null,null,null,null,4]
[null,null,null,23,6,"11 798","2 768","6 048","—","Total",null,109,109,"17 614","17 614","22 381",16,null,null,null,null,null,null,5]
[null,null,"Expérience"]
[null,null,"Attaquant",null,"Défenseur"]
[null,null,0.49299999999999999,"Honneur","/"]
[null,null,"1 469","Expérience de base","/",null,null,"Flèche des arcanes Tour 2"]
[null,null,0.49299999999999999,"Modificateur total","/"]
[null,null,"2 193","Expérience totale","/"]
[]
[null,null,"Pertes définitives",null,null,null,null,null,null,null,null,null,null,null,null,null,null,null,null,null,"A4"]
[null,null,"Attaquant",null,null,null,null,null,null,null,"Défenseur"]
[null,null,"Unité","Effectif",null,"Puissance",null,"Cout en or","Cout en rares","Peloton","Unité","Effectif",null,"Puissance",null,"Cout en or","Cout en rares",null,"A","B","C","D","E"]
[null,null,null,"Initial","Perdu","Initiale","Perdue","des pertes","des pertes",null,null,"Initial","Perdu","Initiale","Perdue","des pertes","des pertes",null,null,null,null,null,null,1]
[null,null,"Démon gardien",35,10,"6 860","1 960","4 780","—",1,"Destrier de cauchemar",4,4,"10 672","10 672","6 800",12,null,null,null,null,null,null,2]
[null,null,"Succube",7,1,"6 426",918,"1 848","—",2,"Archidiable",1,1,"9 555","9 555","—",14,null,null,null,null,null,null,3]
[null,null,null,42,11,"13 286","2 878","6 628","—","Total",null,5,5,"20 227","20 227","6 800",26,null,null,null,null,null,null,4]
[null,null,"Expérience",null,null,null,null,null,null,null,null,null,null,null,null,null,null,null,null,null,null,null,null,5]
[null,null,"Attaquant",null,"Défenseur"]
[null,null,0.52239999999999998,"Honneur","/"]
[null,null,"1 845","Expérience de base","/"]
[null,null,0.52239999999999998,"Modificateur total","/"]
[null,null,"2 809","Expérience totale","/"]
[]
[null,null,"Pertes définitives"]
[null,null,"Attaquant",null,null,null,null,null,null,null,"Défenseur",null,null,null,null,null,null,null,null,null,"E4"]
[null,null,"Unité","Effectif",null,"Puissance",null,"Cout en or","Cout en rares","Peloton","Unité","Effectif",null,"Puissance",null,"Cout en or","Cout en rares"]
[null,null,null,"Initial","Perdu","Initiale","Perdue","des pertes","des pertes",null,null,"Initial","Perdu","Initiale","Perdue","des pertes","des pertes",null,"A","B","C","D","E"]
[null,null,"Familier",64,19,"5 504","1 634","4 294","—",1,"Conscrit",95,95,"12 160","12 160","26 315","—",null,null,null,null,null,null,1]
[null,null,"Démon cornu",45,13,"7 335","2 119","5 187","—",2,"Paladin",1,1,"4 508","4 508","2 900",4,null,null,null,null,null,null,2]
[null,null,null,null,null,null,null,null,null,3,"Cavalier",1,1,"3 188","3 188","2 400",3,null,null,null,null,null,null,3]
[null,null,null,109,32,"12 839","3 753","9 481","—","Total",null,97,97,"19 856","19 856","31 615",7,null,null,null,null,null,null,4]
[null,null,"Expérience",null,null,null,null,null,null,null,null,null,null,null,null,null,null,null,null,null,null,null,null,5]
[null,null,"Attaquant",null,"Défenseur"]
[null,null,0.54649999999999999,"Honneur","/"]
[null,null,"1 452","Expérience de base","/"]
[null,null,0.54649999999999999,"Modificateur total","/"]
[null,null,"2 246","Expérience totale","/"]
[]
[null,null,"Pertes définitives"]
[null,null,"Attaquant",null,null,null,null,null,null,null,"Défenseur",null,null,null,null,null,null,null,null,null,"B5"]
[null,null,"Unité","Effectif",null,"Puissance",null,"Cout en or","Cout en rares","Peloton","Unité","Effectif",null,"Puissance",null,"Cout en or","Cout en rares"]
[null,null,null,"Initial","Perdu","Initiale","Perdue","des pertes","des pertes",null,null,"Initial","Perdu","Initiale","Perdue","des pertes","des pertes",null,"A","B","C","D","E"]
[null,null,"Familier",59,17,"5 074","1 462","3 842","—",1,"Squelette",94,94,"8 178","8 178","19 646","—",null,null,null,null,null,null,1]
[null,null,"Démon cornu",21,6,"3 423",978,"2 394","—",2,"Spectre",15,15,"5 460","5 460","13 680","—",null,null,null,null,null,null,2]
[null,null,"Chien des enfers",5,1,"1 850",370,840,"—",3,"Liche",2,2,"2 860","2 860","2 000",4,null,null,null,null,null,null,3]
[null,null,null,85,24,"10 347","2 810","7 076","—","Total",null,111,111,"16 498","16 498","35 326",4,null,null,null,null,null,null,4]
[null,null,"Expérience",null,null,null,null,null,null,null,null,null,null,null,null,null,null,null,null,null,null,null,null,5]
[null,null,"Attaquant",null,"Défenseur"]
[null,null,0.59450000000000003,"Honneur","/"]
[null,null,"1 148","Expérience de base","/"]
[null,null,0.59450000000000003,"Modificateur total","/"]
[null,null,"1 830","Expérience totale","/"]
[]
[null,null,"Pertes définitives"]
[null,null,"Attaquant",null,null,null,null,null,null,null,"Défenseur",null,null,null,null,null,null,null,null,null,"C5"]
[null,null,"Unité","Effectif",null,"Puissance",null,"Cout en or","Cout en rares","Peloton","Unité","Effectif",null,"Puissance",null,"Cout en or","Cout en rares"]
[null,null,null,"Initial","Perdu","Initiale","Perdue","des pertes","des pertes",null,null,"Initial","Perdu","Initiale","Perdue","des pertes","des pertes",null,"A","B","C","D","E"]
[null,null,"Démon cornu",36,10,"5 868","1 630","3 990","—",1,"Dragon d'émeraude",1,1,"9 077","9 077","—",14,null,null,null,null,null,null,1]
[null,null,"Chien des enfers",7,2,"2 590",740,"1 680","—",2,"Druide",4,4,"3 672","3 672","7 392","—",null,null,null,null,null,null,2]
[null,null,"Familier",62,18,"5 332","1 548","4 068","—",3,"Dryade",31,31,"3 286","3 286","7 812","—",null,null,null,null,null,null,3]
[null,null,null,null,null,null,null,null,null,4,"Fine-lame",11,11,"1 793","1 793","4 389","—",null,null,null,null,null,null,4]
[null,null,null,105,30,"13 790","3 918","9 738","—","Total",null,47,47,"17 828","17 828","19 593",14,null,null,null,null,null,null,5]
[null,null,"Expérience"]
[null,null,"Attaquant",null,"Défenseur"]
[null,null,0.2928,"Honneur","/"]
[null,null,"1 552","Expérience de base","/"]
[null,null,0.2928,"Modificateur total","/"]
[null,null,"2 007","Expérience totale","/"]

{"sheet":"HD2.2","index":16,"n_rows":168,"n_cols":75,"rows_kept":168,"cut":false,"hidden":false,"merged":[[4,10,5,10],[4,11,4,12],[4,13,4,14],[10,2,10,4],[184,11,184,12],[184,13,184,14],[191,2,191,4],[2,2,2,16],[3,2,3,8],[3,10,3,16],[4,2,5,2],[4,3,4,4],[4,5,4,6],[4,9,5,9],[161,13,161,14],[168,2,168,4],[182,2,182,16],[183,2,183,8],[183,10,183,16],[184,2,185,2],[184,3,184,4],[184,5,184,6],[184,9,185,9],[184,10,185,10],[151,2,151,4],[159,2,159,16],[160,2,160,8],[160,10,160,16],[161,2,162,2],[161,3,161,4],[161,5,161,6],[161,9,162,9],[161,10,162,10],[161,11,161,12],[145,2,145,8],[145,10,145,16],[146,2,147,2],[146,3,146,4],[146,5,146,6],[146,9,147,9],[146,10,147,10],[146,11,146,12],[146,13,146,14],[130,11,130,12],[130,13,130,14],[135,2,135,8],[137,2,137,4],[138,8,138,10],[144,2,144,16],[115,13,115,14],[121,2,121,4],[128,2,128,16],[129,2,129,8],[129,10,129,16],[130,2,131,2],[130,3,130,4],[130,5,130,6],[130,9,131,9],[130,10,131,10],[115,2,116,2],[115,3,115,4],[115,5,115,6],[115,9,116,9],[115,10,116,10],[115,11,115,12],[101,13,101,14],[104,2,104,8],[106,2,106,4],[113,2,113,16],[114,2,114,8],[114,10,114,16],[101,2,102,2],[101,3,101,4],[101,5,101,6],[101,9,102,9],[101,10,102,10],[101,11,101,12],[85,13,85,14],[89,2,89,8],[91,2,91,4],[99,2,99,16],[100,2,100,8],[100,10,100,16],[85,2,86,2],[85,3,85,4],[85,5,85,6],[85,9,86,9],[85,10,86,10],[85,11,85,12],[69,13,69,14],[74,2,74,8],[76,2,76,4],[83,2,83,16],[84,2,84,8],[84,10,84,16],[69,2,70,2],[69,3,69,4],[69,5,69,6],[69,9,70,9],[69,10,70,10],[69,11,69,12],[37,11,37,12],[37,13,37,14],[42,2,42,4],[67,2,67,16],[68,2,68,8],[68,10,68,16],[35,2,35,16],[36,2,36,8],[36,10,36,16],[37,2,38,2],[37,3,37,4],[37,5,37,6],[37,9,38,9],[37,10,38,10],[26,2,26,4],[19,2,19,16],[20,2,20,8],[20,10,20,16],[21,2,22,2],[21,3,21,4],[21,5,21,6],[21,9,22,9],[21,10,22,10],[21,11,21,12],[21,13,21,14]]}
[null,null,null,null,null,"Niv. 7 Magicien dérangé",null,null,null,null,null,null,null,null,null,null,null,null,null,null,null,null,null,null,null,null,null,null,"LANCER LES COMBATS EN //",null,null,null,null,null,null,"OPTIMISER LES XP",null,null,null,null,null,null,null,null,null,null,null,null,null,null,null,null,null,null,null,null,null,null,null,null,null,null,null,null,null,null,17,17,12,null,9,null,null,null,"Accroissement"]
[null,null,null,null,null,null,null,null,null,null,null,null,null,null,null,null,null,null,null,null,null,null,null,null,null,null,null,null,null,null,null,null,null,"ENGAGES/BESOINS",null,null,null,null,null,null,null,"PERTES/GAINS",null,null,null,null,null,null,null,"ACHATS/BESOINS SUP.",null,null,null,null,null,null,null,"TOTAL DISPONIBLES",null,null,null,null,null,null,null,null,null,null,"RESERVES"]
[null,null,"Pertes définitives",null,null,null,null,null,null,null,null,null,null,null,null,null,null,null,null,null,null,null,null,null,null,null,null,null,null,null,null," ","Famillier","Démon cornu"," ","Chien des enfers"," ","Succube",null," ","Famillier","Démon cornu"," ","Chien des enfers"," ","Succube",null," ","Famillier","Démon cornu"," ","Chien des enfers"," ","Succube",null," ","Famillier","Démon cornu"," ","Chien des enfers"," ","Succube",null,null,null,"Fin"," ","Famillier","Démon cornu"," ","Chien des enfers"," ","Succube"]
[null,null,"Attaquant",null,null,null,null,null,null,null,"Défenseur",null,null,null,null,null,null,null,null,null,"C4",null,null,null,null,null,null,null,"Qx","Pos","Manque","T1","T1+","T2","T2+","T3","T3+","T4","T4+","T1","T1+","T2","T2+","T3","T3+","T4","T4+","T1","T1+","T2","T2+","T3","T3+","T4","T4+","T1","T1+","T2","T2+","T3","T3+","T4","T4+","XP","Total XP","Date Heure","T1","T1+","T2","T2+","T3","T3+","T4","T4+","Maintenant"]
[null,null,"Unité","Effectif",null,"Puissance",null,"Cout en or","Cout en rares","Peloton","Unité","Effectif",null,"Puissance",null,"Cout en or","Cout en rares",null,null,null,null,null,null,null,null,null,null,null,null,null,null,null,null,null,null,null,null,null,null,null,null,null,null,null,null,null,null,null,null,null,null,null,null,null,null,null,85,26,null,13,null,7,2,null,49942,"2010-09-18T12:39:00",70,70,40,null,15,null,null,null,{"$f":"NOW()","v":"2010-09-29T23:41:22.700"}]
[null,null,null,"Initial","Perdu","Initiale","Perdue","des pertes","des pertes",null,null,"Initial","Perdu","Initiale","Perdue","des pertes","des pertes",null,"A","B","C","D","E",null,null,null,null,null,"Q9","C4",{"$f":"IF(AF6<=BD5+AV6,0,AF6-(BD5+AV6))+IF(AG6<=BE5+AW6,0,AG6-(BE5+AW6))+IF(AH6<=BF5+AX6,0,AH6-(BF5+AX6))+IF(AI6<=BG5+AY6,0,AI6-(BG5+AY6))+IF(AJ6<=BH5+AZ6,0,AJ6-(BH5+AZ6))+IF(AK6<=BI5+BA6,0,AK6-(BI5+BA6))+IF(AL6<=BJ5+BB6,0,AL6-(BJ5+BB6))+IF(AM6<=BK5+BC6,0,AM6-(BK5+BC6))","v":0},null,null,null,null,null,null,null,null,null,null,null,null,null,null,null,null,null,null,null,null,null,null,null,null,{"$f":"BD5+AN6+AV6","v":0},{"$f":"BE5+AO6+AW6","v":85},26,0,13,0,7,2,null,{"$f":"BM5+BL6","v":49942},"2010-09-18T13:39:00"]
[null,null,"Succube",6,1,5508,918,1848,"—",1,"Fantassin",34,34,13838,13838,29920,"—",null,null,null,null,null,null,1,null,null,null,null,null,"A1",0,null,null,null,null,null,null,null,null,null,null,null,null,null,null,null,null,null,null,null,null,null,null,null,null,{"$f":"BD6+AN7+AV7","v":0},{"$f":"BE6+AO7+AW7","v":85},{"$f":"BF6+AP7+AX7","v":26},{"$f":"BG6+AQ7+AY7","v":0},{"$f":"BH6+AR7+AZ7","v":13},{"$f":"BI6+AS7+BA7","v":0},{"$f":"BJ6+AT7+BB7","v":7},{"$f":"BK6+AU7+BC7","v":2},null,{"$f":"BM6+BL7","v":49942},"2010-09-19T13:38:59.995"]
[null,null,"Maitresse succube",3,1,3303,1101,2217,"—",2,"Conscrit",63,63,8064,8064,17451,"—",null,null,null,null,null,null,2,null,null,null,null,null,"B1",0,null,null,null,null,null,null,null,null,null,null,null,null,null,null,null,null,null,null,null,null,null,null,null,null,0,85,26,0,13,0,7,2,null,49942,"2010-09-20T13:38:59.995"]
[null,null,"Familier",80,12,6880,1032,2712,"—",3,"Paysan",77,77,7469,7469,16940,"—",null,null,null,null,null,null,3,null,null,null,null,null,"C1",0,null,null,null,null,null,null,null,null,null,null,null,null,null,null,null,null,null,null,null,null,null,null,null,null,0,85,26,0,13,0,7,2,null,49942,"2010-09-21T13:38:59.995"]
[null,null,null,89,14,15691,3051,6777,"—","Total",null,174,174,29371,29371,64311,"—",null,null,null,null,null,null,4,null,null,null,null,null,"D1",0,null,null,null,null,null,null,null,null,null,null,null,null,null,null,null,null,null,null,null,null,null,null,null,null,0,85,26,0,13,0,7,2,null,49942,"2010-09-22T13:38:59.995"]
[null,null,"Expérience",null,null,null,null,null,null,null,null,null,null,null,null,null,null,null,null,null,null,null,null,5,null,null,null,null,null,"E1",0,null,null,null,null,null,null,null,null,null,null,null,null,null,null,null,null,null,null,null,null,null,null,null,null,0,85,26,0,13,0,7,2,null,49942,"2010-09-23T13:38:59.995"]
[null,null,"Attaquant",null,"Défenseur",null,null,null,null,null,null,null,null,null,null,null,null,null,null,null,null,null,null,null,null,null,null,null,null,"A2",0,null,null,null,null,null,null,null,null,null,null,null,null,null,null,null,null,null,null,null,null,null,null,null,null,0,85,26,0,13,0,7,2,null,49942,"2010-09-24T13:38:59.995"]
[null,null,0.87180000000000002,"Honneur","/",null,null,null,null,null,null,null,null,null,null,null,null,null,null,null,null,null,null,null,null,null,null,null,null,"B2",0,null,null,null,null,null,null,null,null,null,null,null,null,null,null,null,null,null,null,null,null,null,null,null,null,0,85,26,0,13,0,7,2,null,49942,"2010-09-25T13:38:59.995"]
[null,null,1958,"Expérience de base","/",null,null,"Victoire écrasante",null,null,null,null,null,null,null,null,null,null,null,null,null,null,null,null,null,null,null,null,null,"E2",0,null,null,null,null,null,null,null,null,null,null,null,null,null,null,null,null,null,null,null,null,null,null,null,null,0,85,26,0,13,0,7,2,null,49942,"2010-09-26T13:38:59.995"]
[null,null,0.87180000000000002,"Modificateur total","/",null,null,"Flèche des arcanes au tour 1",null,null,null,null,null,null,null,null,null,null,null,null,null,null,null,null,null,null,null,null,null,"A3",0,null,null,null,null,null,null,null,null,null,null,null,null,null,null,null,null,null,null,null,null,null,null,null,null,0,85,26,0,13,0,7,2,null,49942,"2010-09-27T13:38:59.995"]
[{"$f":"C16/G10","v":1.2012454932808916},null,3665,"Expérience totale","/",null,null,null,null,null,null,null,null,null,null,null,null,null,null,null,null,null,null,null,null,null,null,null,null,"B3",0,null,null,null,null,null,null,null,null,null,null,null,null,null,null,null,null,null,null,null,null,null,null,null,null,0,85,26,0,13,0,7,2,null,49942,"2010-09-28T13:38:59.995"]
[null,null,null,null,null,null,null,null,null,null,null,null,null,null,null,null,null,null,null,null,null,null,null,null,null,null,null,null,null,"E3",0,null,null,null,null,null,null,null,null,null,null,null,null,null,null,null,null,null,null,null,null,null,null,null,null,0,85,26,0,13,0,7,2,null,49942,"2010-09-29T13:38:59.995"]
[null,null,null,null,null,null,null,null,null,null,null,null,null,null,null,null,null,null,null,null,null,null,null,null,null,null,null,null,null,"A4",0,null,null,null,null,null,null,null,null,null,null,null,null,null,null,null,null,null,null,null,null,null,null,null,null,0,85,26,0,13,0,7,2,null,49942,"2010-09-30T13:38:59.995"]
[null,null,null,null,null,null,null,null,null,null,null,null,null,null,null,null,null,null,null,null,null,null,null,null,null,null,null,null,null,"D4",0,null,null,null,null,null,null,null,null,null,null,null,null,null,null,null,null,null,null,null,null,null,null,null,null,0,85,26,0,13,0,7,2,null,49942,"2010-10-01T13:38:59.995"]
[null,null,"Pertes définitives",null,null,null,null,null,null,null,null,null,null,null,null,null,null,null,null,null,null,null,null,null,null,null,null,null,null,"E4",0,null,null,null,null,null,null,null,null,null,null,null,null,null,null,null,null,null,null,null,null,null,null,null,null,0,85,26,0,13,0,7,2,null,49942,"2010-10-02T13:38:59.995"]
[null,null,"Attaquant",null,null,null,null,null,null,null,"Défenseur",null,null,null,null,null,null,null,null,null,null,null,null,null,null,null,null,null,null,"A5",0,null,null,null,null,null,null,null,null,null,null,null,null,null,null,null,null,null,null,null,null,null,null,null,null,0,85,26,0,13,0,7,2,null,49942,"2010-10-03T13:38:59.995"]
[null,null,"Unité","Effectif",null,"Puissance",null,"Cout en or","Cout en rares","Peloton","Unité","Effectif",null,"Puissance",null,"Cout en or","Cout en rares",null,null,null,null,null,null,null,null,null,null,null,null,"B5",0,null,null,null,null,null,null,null,null,null,null,null,null,null,null,null,null,null,null,null,null,null,null,null,null,0,85,26,0,13,0,7,2,null,49942,"2010-10-04T13:38:59.995"]
[null,null,null,"Initial","Perdu","Initiale","Perdue","des pertes","des pertes",null,null,"Initial","Perdu","Initiale","Perdue","des pertes","des pertes",null,null,null,"E3",null,null,null,null,null,null,null,null,"C5",0,null,null,null,null,null,null,null,null,null,null,null,null,null,null,null,null,null,null,null,null,null,null,null,null,0,85,26,0,13,0,7,2,null,49942,"2010-10-05T13:38:59.995"]
[null,null,"Familier",127,38,10922,3268,8588,"—",1,"Rani Rakshasa",7,7,15694,15694,12600,21,null,null,null,null,null,null,null,null,null,null,null,null,"D5",0,null,null,null,null,null,null,null,null,null,null,null,null,null,null,null,null,null,null,null,null,null,null,null,null,0,85,26,0,13,0,7,2,null,49942,"2010-10-06T13:38:59.995"]
[null,null,"Démon cornu",104,9,16952,1467,3591,"—",2,"Sultan djinn",7,7,13958,13958,9800,21,null,"A","B","C","D","E",null,null,null,null,null,null,"E5",0,null,null,null,null,null,null,null,null,null,null,null,null,null,null,null,null,null,null,null,null,null,null,null,null,0,85,26,0,13,0,7,2,null,49942,"2010-10-07T13:38:59.995"]
[null,null,null,231,47,27874,4735,12179,"—","Total",null,14,14,29652,29652,22400,42,null,null,null,null,null,null,1]
[null,null,"Expérience",null,null,null,null,null,null,null,null,null,null,null,null,null,null,null,null,null,null,null,null,2]
[null,null,"Attaquant",null,"Défenseur",null,null,null,null,null,null,null,null,null,null,null,null,null,null,null,null,null,null,3]
[null,null,6.3799999999999996E-2,"Honneur","/",null,null,null,null,null,null,null,null,null,null,null,null,null,null,null,null,null,null,4]
[null,null,2471,"Expérience de base","/",null,null,"Mage de guerre niveau 1",null,null,null,null,null,null,null,null,null,null,null,null,null,null,null,5]
[null,null,6.3799999999999996E-2,"Modificateur total","/",null,null,"Victoire moyenne"]
[{"$f":"C32/G26","v":0.55522703273495244},null,2629,"Expérience totale","/"]
[]
[]
[]
[null,null,"Pertes définitives",null,null,null,null,null,null,null,null,null,null,null,null,null,null,null,null,null,"B1"]
[null,null,"Attaquant",null,null,null,null,null,null,null,"Défenseur"]
[null,null,"Unité","Effectif",null,"Puissance",null,"Cout en or","Cout en rares","Peloton","Unité","Effectif",null,"Puissance",null,"Cout en or","Cout en rares",null,"A","B","C","D","E"]
[null,null,null,"Initial","Perdu","Initiale","Perdue","des pertes","des pertes",null,null,"Initial","Perdu","Initiale","Perdue","des pertes","des pertes",null,null,null,null,null,null,1]
[null,null,"Familier",237,71,20382,6106,16046,"—",1,"Zombie",296,296,39664,39664,106856,"—",null,null,null,null,null,null,2]
[null,null,"Succube",14,3,12852,2754,5544,"—",2,"Squelette",171,171,14877,14877,35739,"—",null,null,null,null,null,null,3]
[null,null,null,251,74,33234,8860,21590,"—","Total",null,467,467,54541,54541,142595,"—",null,null,null,null,null,null,4]
[null,null,"Expérience",null,null,null,null,null,null,null,null,null,null,null,null,null,null,null,null,null,null,null,null,5]
[null,null,"Attaquant",null,"Défenseur"]
[null,null,0.6411,"Honneur","/"]
[null,null,3636,"Expérience de base","/"]
[null,null,0.6411,"Modificateur total","/"]
[{"$f":"C48/G42","v":0.67347629796839725},null,5967,"Expérience totale","/"]
[]
[]
[null,null,null,null,null,null,null,null,null,null,null,null,null,null,null,null,null,null,null,null,"C1"]
[]
[null,null,null,null,null,null,null,null,null,null,null,null,null,null,null,null,null,null,"A","B","C","D","E"]
[null,null,null,null,null,null,null,null,null,null,null,null,null,null,null,null,null,null,null,null,null,null,null,1]
[null,null,null,null,null,null,null,null,null,null,null,null,null,null,null,null,null,null,null,null,null,null,null,2]
[null,null,null,null,null,null,null,null,null,null,null,null,null,null,null,null,null,null,null,null,null,null,null,3]
[null,null,null,null,null,null,null,null,null,null,null,null,null,null,null,null,null,null,null,null,null,null,null,4]
[null,null,null,null,null,null,null,null,null,null,null,null,null,null,null,null,null,null,null,null,null,null,null,5]
[]
[]
[]
[]
[]
[]
[]
[]
[]
[]
[]
[null,null,null,null,null,null,null,null,null,null,null,null,null,null,null,null,null,null,null,null,"A5"]
[]
[null,null,null,null,null,null,null,null,null,null,null,null,null,null,null,null,null,null,"A","B","C","D","E"]
[null,null,null,null,null,null,null,null,null,null,null,null,null,null,null,null,null,null,null,null,null,null,null,1]
[null,null,null,null,null,null,null,null,null,null,null,null,null,null,null,null,null,null,null,null,null,null,null,2]
[null,null,null,null,null,null,null,null,null,null,null,null,null,null,null,null,null,null,null,null,null,null,null,3]
[null,null,null,null,null,null,null,null,null,null,null,null,null,null,null,null,null,null,null,null,null,null,null,4]
[null,null,null,null,null,null,null,null,null,null,null,null,null,null,null,null,null,null,null,null,null,null,null,5]
[]
[]
[]
[]
[]
[]
[]
[null,null,null,null,null,null,null,null,null,null,null,null,null,null,null,null,null,null,null,null,"D5",null,"3h36mn14"]
[]
[null,null,null,null,null,null,null,null,null,null,null,null,null,null,null,null,null,null,"A","B","C","D","E"]
[null,null,null,null,null,null,null,null,null,null,null,null,null,null,null,null,null,null,null,null,null,null,null,1]
[null,null,null,null,null,null,null,null,null,null,null,null,null,null,null,null,null,null,null,null,null,null,null,2]
[null,null,null,null,null,null,null,null,null,null,null,null,null,null,null,null,null,null,null,null,null,null,null,3]
[null,null,null,null,null,null,null,null,null,null,null,null,null,null,null,null,null,null,null,null,null,null,null,4]
[null,null,null,null,null,null,null,null,null,null,null,null,null,null,null,null,null,null,null,null,null,null,null,5]
[]
[]
[]
[]
[]
[]
[]
[null,null,null,null,null,null,null,null,null,null,null,null,null,null,null,null,null,null,null,"3h20mn5s"]
[null,null,null,null,null,null,null,null,null,null,null,null,null,null,null,null,null,null,null,null,"C5"]
[]
[null,null,null,null,null,null,null,null,null,null,null,null,null,null,null,null,null,null,"A","B","C","D","E"]
[null,null,null,null,null,null,null,null,null,null,null,null,null,null,null,null,null,null,null,null,null,null,null,1]
[null,null,null,null,null,null,null,null,null,null,null,null,null,null,null,null,null,null,null,null,null,null,null,2]
[null,null,null,null,null,null,null,null,null,null,null,null,null,null,null,null,null,null,null,null,null,null,null,3]
[null,null,null,null,null,null,null,null,null,null,null,null,null,null,null,null,null,null,null,null,null,null,null,4]
[null,null,null,null,null,null,null,null,null,null,null,null,null,null,null,null,null,null,null,null,null,null,null,5]
[]
[]
[]
[]
[]
[]
[null,null,null,null,null,null,null,null,null,null,null,null,null,null,null,null,null,null,null,null,"A4"]
[]
[null,null,null,null,null,null,null,null,null,null,null,null,null,null,null,null,null,null,"A","B","C","D","E"]
[null,null,null,null,null,null,null,null,null,null,null,null,null,null,null,null,null,null,null,null,null,null,null,1]
[null,null,null,null,null,null,null,null,null,null,null,null,null,null,null,null,null,null,null,null,null,null,null,2]
[null,null,null,null,null,null,null,null,null,null,null,null,null,null,null,null,null,null,null,null,null,null,null,3]
[null,null,null,null,null,null,null,null,null,null,null,null,null,null,null,null,null,null,null,null,null,null,null,4]
[null,null,null,null,null,null,null,null,null,null,null,null,null,null,null,null,null,null,null,null,null,null,null,5]
[]
[]
[]
[]
[]
[]
[]
[null,null,null,null,null,null,null,null,null,null,null,null,null,null,null,null,null,null,null,null,"A1"]
[]
[null,null,null,null,null,null,null,null,null,null,null,null,null,null,null,null,null,null,"A","B","C","D","E"]
[null,null,null,null,null,null,null,null,null,null,null,null,null,null,null,null,null,null,null,null,null,null,null,1]
[null,null,null,null,null,null,null,null,null,null,null,null,null,null,null,null,null,null,null,null,null,null,null,2]
[null,null,null,null,null,null,null,null,null,null,null,null,null,null,null,null,null,null,null,null,null,null,null,3]
[null,null,null,null,null,null,null,null,null,null,null,null,null,null,null,null,null,null,null,null,null,null,null,4]
[null,null,null,null,null,null,null,null,null,null,null,null,null,null,null,null,null,null,null,null,null,null,null,5]
[]
[]
[]
[]
[]
[]
[]
[]
[null,null,null,null,null,null,null,null,null,null,null,null,null,null,null,null,null,null,null,null,"C1"]
[]
[null,null,null,null,null,null,null,null,null,null,null,null,null,null,null,null,null,null,"A","B","C","D","E"]
[null,null,null,null,null,null,null,null,null,null,null,null,null,null,null,null,null,null,null,null,null,null,null,1]
[null,null,null,null,null,null,null,null,null,null,null,null,null,null,null,null,null,null,null,null,null,null,null,2]
[null,null,null,null,null,null,null,null,null,null,null,null,null,null,null,null,null,null,null,null,null,null,null,3]
[null,null,null,null,null,null,null,null,null,null,null,null,null,null,null,null,null,null,null,null,null,null,null,4]
[null,null,null,null,null,null,null,null,null,null,null,null,null,null,null,null,null,null,null,null,null,null,null,5]
[]
[]
[]
[]
[]
[]
[]
[null,null,null,null,null,null,null,null,null,null,null,null,null,null,null,null,null,null,null,null,"E1"]
[]
[null,null,null,null,null,null,null,null,null,null,null,null,null,null,null,null,null,null,"A","B","C","D","E"]
[null,null,null,null,null,null,null,null,null,null,null,null,null,null,null,null,null,null,null,null,null,null,null,1]
[null,null,null,null,null,null,null,null,null,null,null,null,null,null,null,null,null,null,null,null,null,null,null,2]
[null,null,null,null,null,null,null,null,null,null,null,null,null,null,null,null,null,null,null,null,null,null,null,3]
[null,null,null,null,null,null,null,null,null,null,null,null,null,null,null,null,null,null,null,null,null,null,null,4]
[null,null,null,null,null,null,null,null,null,null,null,null,null,null,null,null,null,null,null,null,null,null,null,5]

{"sheet":"HD2.3","index":17,"n_rows":168,"n_cols":75,"rows_kept":168,"cut":false,"hidden":false,"merged":[[184,11,184,12],[184,13,184,14],[191,2,191,4],[8,2,8,8],[9,2,9,8],[11,2,11,4],[42,2,42,8],[44,2,44,4],[161,13,161,14],[168,2,168,4],[182,2,182,16],[183,2,183,8],[183,10,183,16],[184,2,185,2],[184,3,184,4],[184,5,184,6],[184,9,185,9],[184,10,185,10],[151,2,151,4],[159,2,159,16],[160,2,160,8],[160,10,160,16],[161,2,162,2],[161,3,161,4],[161,5,161,6],[161,9,162,9],[161,10,162,10],[161,11,161,12],[145,2,145,8],[145,10,145,16],[146,2,147,2],[146,3,146,4],[146,5,146,6],[146,9,147,9],[146,10,147,10],[146,11,146,12],[146,13,146,14],[130,11,130,12],[130,13,130,14],[135,2,135,8],[137,2,137,4],[138,8,138,10],[144,2,144,16],[115,13,115,14],[121,2,121,4],[128,2,128,16],[129,2,129,8],[129,10,129,16],[130,2,131,2],[130,3,130,4],[130,5,130,6],[130,9,131,9],[130,10,131,10],[115,2,116,2],[115,3,115,4],[115,5,115,6],[115,9,116,9],[115,10,116,10],[115,11,115,12],[101,13,101,14],[104,2,104,8],[106,2,106,4],[113,2,113,16],[114,2,114,8],[114,10,114,16],[101,2,102,2],[101,3,101,4],[101,5,101,6],[101,9,102,9],[101,10,102,10],[101,11,101,12],[85,13,85,14],[89,2,89,8],[91,2,91,4],[99,2,99,16],[100,2,100,8],[100,10,100,16],[85,2,86,2],[85,3,85,4],[85,5,85,6],[85,9,86,9],[85,10,86,10],[85,11,85,12],[69,13,69,14],[74,2,74,8],[76,2,76,4],[83,2,83,16],[84,2,84,8],[84,10,84,16],[69,2,70,2],[69,3,69,4],[69,5,69,6],[69,9,70,9],[69,10,70,10],[69,11,69,12],[37,11,37,12],[37,13,37,14],[67,2,67,16],[68,2,68,8],[68,10,68,16],[21,13,21,14],[26,2,26,4],[35,2,35,16],[36,2,36,8],[36,10,36,16],[37,2,38,2],[37,3,37,4],[37,5,37,6],[37,9,38,9],[37,10,38,10],[19,2,19,16],[20,2,20,8],[20,10,20,16],[21,2,22,2],[21,3,21,4],[21,5,21,6],[21,9,22,9],[21,10,22,10],[21,11,21,12],[2,2,2,16],[3,2,3,8],[3,10,3,16],[4,2,5,2],[4,3,4,4],[4,5,4,6],[4,9,5,9],[4,10,5,10],[4,11,4,12],[4,13,4,14]]}
[null,null,null,null,null,null,null,null,null,null,null,null,null,null,null,null,null,null,null,null,null,null,null,null,null,null,null,null,"LANCER LES COMBATS EN //",null,null,null,null,null,null,"OPTIMISER LES XP",null,null,null,null,null,null,null,null,null,null,null,null,null,null,null,null,null,null,null,null,null,null,null,null,null,null,null,null,null,null,17,17,12,null,9,null,null,null,"Accroissement"]
[null,null,null,null,null,null,null,null,null,null,null,null,null,null,null,null,null,null,null,null,null,null,null,null,null,null,null,null,null,null,null,null,null,"ENGAGES/BESOINS",null,null,null,null,null,null,null,"PERTES/GAINS",null,null,null,null,null,null,null,"ACHATS/BESOINS SUP.",null,null,null,null,null,null,null,"TOTAL DISPONIBLES",null,null,null,null,null,null,null,null,null,null,"RESERVES"]
[null,null,"Pertes définitives",null,null,null,null,null,null,null,null,null,null,null,null,null,null,null,null,null,null,null,null,null,null,null,null,null,null,null,null," ","Famillier","Démon cornu"," ","Chien des enfers"," ","Succube",null," ","Famillier","Démon cornu"," ","Chien des enfers"," ","Succube",null," ","Famillier","Démon cornu"," ","Chien des enfers"," ","Succube",null," ","Famillier","Démon cornu"," ","Chien des enfers"," ","Succube",null,null,null,"Fin"," ","Famillier","Démon cornu"," ","Chien des enfers"," ","Succube"]
[null,null,"Attaquant",null,null,null,null,null,null,null,"Défenseur",null,null,null,null,null,null,null,null,null,"D2",null,null,null,null,null,null,null,"Qx","Pos","Manque","T1","T1+","T2","T2+","T3","T3+","T4","T4+","T1","T1+","T2","T2+","T3","T3+","T4","T4+","T1","T1+","T2","T2+","T3","T3+","T4","T4+","T1","T1+","T2","T2+","T3","T3+","T4","T4+","XP","Total XP","Date Heure","T1","T1+","T2","T2+","T3","T3+","T4","T4+","Maintenant"]
[null,null,"Unité","Effectif",null,"Puissance",null,"Cout en or","Cout en rares","Peloton","Unité","Effectif",null,"Puissance",null,"Cout en or","Cout en rares",null,null,null,null,null,null,null,null,null,null,null,null,null,null,null,null,null,null,null,null,null,null,null,null,null,null,null,null,null,null,null,null,null,null,null,null,null,null,null,85,26,null,13,null,7,2,null,49942,"2010-09-18T12:39:00",70,70,40,null,15,null,null,null,{"$f":"NOW()","v":"2010-09-29T23:41:22.700"}]
[null,null,null,"Initial","Perdu","Initiale","Perdue","des pertes","des pertes",null,null,"Initial","Perdu","Initiale","Perdue","des pertes","des pertes",null,"A","B","C","D","E",null,null,null,null,null,"Q9","C4",{"$f":"IF(AF6<=BD5+AV6,0,AF6-(BD5+AV6))+IF(AG6<=BE5+AW6,0,AG6-(BE5+AW6))+IF(AH6<=BF5+AX6,0,AH6-(BF5+AX6))+IF(AI6<=BG5+AY6,0,AI6-(BG5+AY6))+IF(AJ6<=BH5+AZ6,0,AJ6-(BH5+AZ6))+IF(AK6<=BI5+BA6,0,AK6-(BI5+BA6))+IF(AL6<=BJ5+BB6,0,AL6-(BJ5+BB6))+IF(AM6<=BK5+BC6,0,AM6-(BK5+BC6))","v":0},null,null,null,null,null,null,null,null,null,null,null,null,null,null,null,null,null,null,null,null,null,null,null,null,{"$f":"BD5+AN6+AV6","v":0},{"$f":"BE5+AO6+AW6","v":85},26,0,13,0,7,2,null,{"$f":"BM5+BL6","v":49942},"2010-09-18T13:39:00"]
[null,null,"Chien des enfers",20,6,"7 400","2 220","5 040","—",1,"Archer",55,55,"10 890","10 890","24 200","—",null,null,null,null,null,null,1,null,null,null,null,null,"A1",0,null,null,null,null,null,null,null,null,null,null,null,null,null,null,null,null,null,null,null,null,null,null,null,null,{"$f":"BD6+AN7+AV7","v":0},85,26,0,13,0,7,2,null,{"$f":"BM6+BL7","v":49942},"2010-09-19T13:38:59.995"]
[null,null,"Familier",130,15,"11 180","1 290","3 390","—",2,"Champion",19,19,"9 272","9 272","20 064","—",null,null,null,null,null,null,2,null,null,null,null,null,"B1",0,null,null,null,null,null,null,null,null,null,null,null,null,null,null,null,null,null,null,null,null,null,null,null,null,0,85,26,0,13,0,7,2,null,49942,"2010-09-20T13:38:59.995"]
[null,null,null,null,null,null,null,null,null,3,"Conscrit",43,43,"5 504","5 504","11 911","—",null,null,null,null,null,null,3,null,null,null,null,null,"C1",0,null,null,null,null,null,null,null,null,null,null,null,null,null,null,null,null,null,null,null,null,null,null,null,null,0,85,26,0,13,0,7,2,null,49942,"2010-09-21T13:38:59.995"]
[null,null,null,null,null,null,null,null,null,4,"Fantassin",8,8,"3 256","3 256","7 040","—",null,null,null,null,null,null,4,null,null,null,null,null,"D1",0,null,null,null,null,null,null,null,null,null,null,null,null,null,null,null,null,null,null,null,null,null,null,null,null,0,85,26,0,13,0,7,2,null,49942,"2010-09-22T13:38:59.995"]
[null,null,null,150,21,"18 580","3 510","8 430","—","Total",null,125,125,"28 922","28 922","63 215","—",null,null,null,null,null,null,5,null,null,null,null,null,"E1",0,null,null,null,null,null,null,null,null,null,null,null,null,null,null,null,null,null,null,null,null,null,null,null,null,0,85,26,0,13,0,7,2,null,49942,"2010-09-23T13:38:59.995"]
[null,null,"Expérience",null,null,null,null,null,null,null,null,null,null,null,null,null,null,null,null,null,null,null,null,null,null,null,null,null,null,"A2",0,null,null,null,null,null,null,null,null,null,null,null,null,null,null,null,null,null,null,null,null,null,null,null,null,0,85,26,0,13,0,7,2,null,49942,"2010-09-24T13:38:59.995"]
[null,null,"Attaquant",null,"Défenseur",null,null,null,null,null,null,null,null,null,null,null,null,null,null,null,null,null,null,null,null,null,null,null,null,"B2",0,null,null,null,null,null,null,null,null,null,null,null,null,null,null,null,null,null,null,null,null,null,null,null,null,0,85,26,0,13,0,7,2,null,49942,"2010-09-25T13:38:59.995"]
[null,null,0.55659999999999998,"Honneur","/",null,null,null,null,null,null,null,null,null,null,null,null,null,null,null,null,null,null,null,null,null,null,null,null,"E2",0,null,null,null,null,null,null,null,null,null,null,null,null,null,null,null,null,null,null,null,null,null,null,null,null,0,85,26,0,13,0,7,2,null,49942,"2010-09-26T13:38:59.995"]
[null,null,"1 928","Expérience de base","/",null,null,null,null,null,null,null,null,null,null,null,null,null,null,null,null,null,null,null,null,null,null,null,null,"A3",0,null,null,null,null,null,null,null,null,null,null,null,null,null,null,null,null,null,null,null,null,null,null,null,null,0,85,26,0,13,0,7,2,null,49942,"2010-09-27T13:38:59.995"]
[{"$f":"C16/G10","v":{"$error":"#DIV/0!"}},null,0.55659999999999998,"Modificateur total","/",null,null,null,null,null,null,null,null,null,null,null,null,null,null,null,null,null,null,null,null,null,null,null,null,"B3",0,null,null,null,null,null,null,null,null,null,null,null,null,null,null,null,null,null,null,null,null,null,null,null,null,0,85,26,0,13,0,7,2,null,49942,"2010-09-28T13:38:59.995"]
[null,null,"3 001","Expérience totale","/",null,null,null,null,null,null,null,null,null,null,null,null,null,null,null,null,null,null,null,null,null,null,null,null,"E3",0,null,null,null,null,null,null,null,null,null,null,null,null,null,null,null,null,null,null,null,null,null,null,null,null,0,85,26,0,13,0,7,2,null,49942,"2010-09-29T13:38:59.995"]
[null,null,null,null,null,null,null,null,null,null,null,null,null,null,null,null,null,null,null,null,null,null,null,null,null,null,null,null,null,"A4",0,null,null,null,null,null,null,null,null,null,null,null,null,null,null,null,null,null,null,null,null,null,null,null,null,0,85,26,0,13,0,7,2,null,49942,"2010-09-30T13:38:59.995"]
[null,null,null,null,null,null,null,null,null,null,null,null,null,null,null,null,null,null,null,null,null,null,null,null,null,null,null,null,null,"D4",0,null,null,null,null,null,null,null,null,null,null,null,null,null,null,null,null,null,null,null,null,null,null,null,null,0,85,26,0,13,0,7,2,null,49942,"2010-10-01T13:38:59.995"]
[null,null,"Pertes définitives",null,null,null,null,null,null,null,null,null,null,null,null,null,null,null,null,null,null,null,null,null,null,null,null,null,null,"E4",0,null,null,null,null,null,null,null,null,null,null,null,null,null,null,null,null,null,null,null,null,null,null,null,null,0,85,26,0,13,0,7,2,null,49942,"2010-10-02T13:38:59.995"]
[null,null,"Attaquant",null,null,null,null,null,null,null,"Défenseur",null,null,null,null,null,null,null,null,null,null,null,null,null,null,null,null,null,null,"A5",0,null,null,null,null,null,null,null,null,null,null,null,null,null,null,null,null,null,null,null,null,null,null,null,null,0,85,26,0,13,0,7,2,null,49942,"2010-10-03T13:38:59.995"]
[null,null,"Unité","Effectif",null,"Puissance",null,"Cout en or","Cout en rares","Peloton","Unité","Effectif",null,"Puissance",null,"Cout en or","Cout en rares",null,null,null,null,null,null,null,null,null,null,null,null,"B5",0,null,null,null,null,null,null,null,null,null,null,null,null,null,null,null,null,null,null,null,null,null,null,null,null,0,85,26,0,13,0,7,2,null,49942,"2010-10-04T13:38:59.995"]
[null,null,null,"Initial","Perdu","Initiale","Perdue","des pertes","des pertes",null,null,"Initial","Perdu","Initiale","Perdue","des pertes","des pertes",null,null,null,"D5",null,null,null,null,null,null,null,null,"C5",0,null,null,null,null,null,null,null,null,null,null,null,null,null,null,null,null,null,null,null,null,null,null,null,null,{"$f":"BD22+AN23+AV23","v":0},85,26,0,13,0,7,2,null,49942,"2010-10-05T13:38:59.995"]
[null,null,"Chien des enfers",20,6,"7 400","2 220","5 040","—",1,"Archer squelette",229,229,"16 030","16 030","46 945","—",null,null,null,null,null,null,null,null,null,null,null,null,"D5",0,null,null,null,null,null,null,null,null,null,null,null,null,null,null,null,null,null,null,null,null,null,null,null,null,0,85,26,0,13,0,7,2,null,49942,"2010-10-06T13:38:59.995"]
[null,null,"Familier",128,30,"11 008","2 580","6 780","—",2,"Seigneur vampire",9,9,"8 118","8 118","18 054","—",null,"A","B","C","D","E",null,null,null,null,null,null,"E5",0,null,null,null,null,null,null,null,null,null,null,null,null,null,null,null,null,null,null,null,null,null,null,null,null,0,85,26,0,13,0,7,2,null,49942,"2010-10-07T13:38:59.995"]
[null,null,null,148,36,"18 408","4 800","11 820","—","Total",null,238,238,"24 148","24 148","64 999","—",null,null,null,null,null,null,1]
[null,null,"Expérience",null,null,null,null,null,null,null,null,null,null,null,null,null,null,null,null,null,null,null,null,2]
[null,null,"Attaquant",null,"Défenseur",null,null,null,null,null,null,null,null,null,null,null,null,null,null,null,null,null,null,3]
[null,null,0.31180000000000002,"Honneur","/",null,null,null,null,null,null,null,null,null,null,null,null,null,null,null,null,null,null,4]
[null,null,"1 745","Expérience de base","/",null,null,null,null,null,null,null,null,null,null,null,null,null,null,null,null,null,null,5]
[null,null,0.31180000000000002,"Modificateur total","/"]
[{"$f":"C32/G26","v":{"$error":"#VALUE!"}},null,"2 289","Expérience totale","/"]
[]
[]
[]
[null,null,"Pertes définitives",null,null,null,null,null,null,null,null,null,null,null,null,null,null,null,null,null,"C5"]
[null,null,"Attaquant",null,null,null,null,null,null,null,"Défenseur"]
[null,null,"Unité","Effectif",null,"Puissance",null,"Cout en or","Cout en rares","Peloton","Unité","Effectif",null,"Puissance",null,"Cout en or","Cout en rares",null,"A","B","C","D","E"]
[null,null,null,"Initial","Perdu","Initiale","Perdue","des pertes","des pertes",null,null,"Initial","Perdu","Initiale","Perdue","des pertes","des pertes",null,null,null,null,null,null,1]
[null,null,"Chien des enfers",38,11,"14 060","4 070","9 240","—",1,"Nymphe",167,167,"14 696","14 696","35 070","—",null,null,null,null,null,null,2]
[null,null,"Familier",120,36,"10 320","3 096","8 136","—",2,"Fine-lame",66,66,"10 758","10 758","26 334","—",null,null,null,null,null,null,3]
[null,null,"Chien des enfers",20,4,"7 400","1 480","3 360","—",3,"Lame-de-guerre",40,40,"7 840","7 840","19 160","—",null,null,null,null,null,null,4]
[null,null,null,null,null,null,null,null,null,4,"Dryade",60,60,"6 360","6 360","15 120","—",null,null,null,null,null,null,5]
[null,null,null,178,51,"31 780","8 646","20 736","—","Total",null,333,333,"39 654","39 654","95 684","—"]
[null,null,"Expérience"]
[null,null,"Attaquant",null,"Défenseur"]
[null,null,0.24779999999999999,"Honneur","/"]
[{"$f":"C48/G42","v":{"$error":"#VALUE!"}},null,"2 644","Expérience de base","/"]
[null,null,0.24779999999999999,"Modificateur total","/"]
[null,null,"3 299","Expérience totale","/"]
[null,null,null,null,null,null,null,null,null,null,null,null,null,null,null,null,null,null,null,null,"C1"]
[]
[null,null,null,null,null,null,null,null,null,null,null,null,null,null,null,null,null,null,"A","B","C","D","E"]
[null,null,null,{"$f":"MAX(D56:D59)+F56","v":67},null,null,null,null,null,null,null,null,null,null,null,null,null,null,null,null,null,null,null,1]
[null,null,null,null,null,null,null,null,null,null,null,null,null,null,null,null,null,null,null,null,null,null,null,2]
[null,null,"Chien des enfers",38,11,{"$f":"SUM(E56:E59)","v":27},null,null,null,null,null,null,null,null,null,null,null,null,null,null,null,null,null,3]
[null,null,"Chien des enfers",20,4,null,null,null,null,null,null,null,null,null,null,null,null,null,null,null,null,null,null,4]
[null,null,"Chien des enfers",40,6,null,null,null,null,null,null,null,null,null,null,null,null,null,null,null,null,null,null,5]
[null,null,"Chien des enfers",20,6]
[null,null,"Familier",120,36]
[null,null,"Familier",130,15]
[null,null,"Familier",128,30,{"$f":"SUM(E60:E62)","v":81}]
[]
[null,null,null,{"$f":"MAX(D60:D62)+F62","v":211}]
[]
[]
[]
[]
[]
[null,null,null,null,null,null,null,null,null,null,null,null,null,null,null,null,null,null,null,null,"A5"]
[]
[null,null,null,null,null,null,null,null,null,null,null,null,null,null,null,null,null,null,"A","B","C","D","E"]
[null,null,null,null,null,null,null,null,null,null,null,null,null,null,null,null,null,null,null,null,null,null,null,1]
[null,null,null,null,null,null,null,null,null,null,null,null,null,null,null,null,null,null,null,null,null,null,null,2]
[null,null,null,null,null,null,null,null,null,null,null,null,null,null,null,null,null,null,null,null,null,null,null,3]
[null,null,null,null,null,null,null,null,null,null,null,null,null,null,null,null,null,null,null,null,null,null,null,4]
[null,null,null,null,null,null,null,null,null,null,null,null,null,null,null,null,null,null,null,null,null,null,null,5]
[]
[]
[]
[]
[]
[]
[]
[null,null,null,null,null,null,null,null,null,null,null,null,null,null,null,null,null,null,null,null,"D5",null,"3h36mn14"]
[]
[null,null,null,null,null,null,null,null,null,null,null,null,null,null,null,null,null,null,"A","B","C","D","E"]
[null,null,null,null,null,null,null,null,null,null,null,null,null,null,null,null,null,null,null,null,null,null,null,1]
[null,null,null,null,null,null,null,null,null,null,null,null,null,null,null,null,null,null,null,null,null,null,null,2]
[null,null,null,null,null,null,null,null,null,null,null,null,null,null,null,null,null,null,null,null,null,null,null,3]
[null,null,null,null,null,null,null,null,null,null,null,null,null,null,null,null,null,null,null,null,null,null,null,4]
[null,null,null,null,null,null,null,null,null,null,null,null,null,null,null,null,null,null,null,null,null,null,null,5]
[]
[]
[]
[]
[]
[]
[]
[null,null,null,null,null,null,null,null,null,null,null,null,null,null,null,null,null,null,null,"3h20mn5s"]
[null,null,null,null,null,null,null,null,null,null,null,null,null,null,null,null,null,null,null,null,"C5"]
[]
[null,null,null,null,null,null,null,null,null,null,null,null,null,null,null,null,null,null,"A","B","C","D","E"]
[null,null,null,null,null,null,null,null,null,null,null,null,null,null,null,null,null,null,null,null,null,null,null,1]
[null,null,null,null,null,null,null,null,null,null,null,null,null,null,null,null,null,null,null,null,null,null,null,2]
[null,null,null,null,null,null,null,null,null,null,null,null,null,null,null,null,null,null,null,null,null,null,null,3]
[null,null,null,null,null,null,null,null,null,null,null,null,null,null,null,null,null,null,null,null,null,null,null,4]
[null,null,null,null,null,null,null,null,null,null,null,null,null,null,null,null,null,null,null,null,null,null,null,5]
[]
[]
[]
[]
[]
[]
[null,null,null,null,null,null,null,null,null,null,null,null,null,null,null,null,null,null,null,null,"A4"]
[]
[null,null,null,null,null,null,null,null,null,null,null,null,null,null,null,null,null,null,"A","B","C","D","E"]
[null,null,null,null,null,null,null,null,null,null,null,null,null,null,null,null,null,null,null,null,null,null,null,1]
[null,null,null,null,null,null,null,null,null,null,null,null,null,null,null,null,null,null,null,null,null,null,null,2]
[null,null,null,null,null,null,null,null,null,null,null,null,null,null,null,null,null,null,null,null,null,null,null,3]
[null,null,null,null,null,null,null,null,null,null,null,null,null,null,null,null,null,null,null,null,null,null,null,4]
[null,null,null,null,null,null,null,null,null,null,null,null,null,null,null,null,null,null,null,null,null,null,null,5]
[]
[]
[]
[]
[]
[]
[]
[null,null,null,null,null,null,null,null,null,null,null,null,null,null,null,null,null,null,null,null,"A1"]
[]
[null,null,null,null,null,null,null,null,null,null,null,null,null,null,null,null,null,null,"A","B","C","D","E"]
[null,null,null,null,null,null,null,null,null,null,null,null,null,null,null,null,null,null,null,null,null,null,null,1]
[null,null,null,null,null,null,null,null,null,null,null,null,null,null,null,null,null,null,null,null,null,null,null,2]
[null,null,null,null,null,null,null,null,null,null,null,null,null,null,null,null,null,null,null,null,null,null,null,3]
[null,null,null,null,null,null,null,null,null,null,null,null,null,null,null,null,null,null,null,null,null,null,null,4]
[null,null,null,null,null,null,null,null,null,null,null,null,null,null,null,null,null,null,null,null,null,null,null,5]
[]
[]
[]
[]
[]
[]
[]
[]
[null,null,null,null,null,null,null,null,null,null,null,null,null,null,null,null,null,null,null,null,"C1"]
[]
[null,null,null,null,null,null,null,null,null,null,null,null,null,null,null,null,null,null,"A","B","C","D","E"]
[null,null,null,null,null,null,null,null,null,null,null,null,null,null,null,null,null,null,null,null,null,null,null,1]
[null,null,null,null,null,null,null,null,null,null,null,null,null,null,null,null,null,null,null,null,null,null,null,2]
[null,null,null,null,null,null,null,null,null,null,null,null,null,null,null,null,null,null,null,null,null,null,null,3]
[null,null,null,null,null,null,null,null,null,null,null,null,null,null,null,null,null,null,null,null,null,null,null,4]
[null,null,null,null,null,null,null,null,null,null,null,null,null,null,null,null,null,null,null,null,null,null,null,5]
[]
[]
[]
[]
[]
[]
[]
[null,null,null,null,null,null,null,null,null,null,null,null,null,null,null,null,null,null,null,null,"E1"]
[]
[null,null,null,null,null,null,null,null,null,null,null,null,null,null,null,null,null,null,"A","B","C","D","E"]
[null,null,null,null,null,null,null,null,null,null,null,null,null,null,null,null,null,null,null,null,null,null,null,1]
[null,null,null,null,null,null,null,null,null,null,null,null,null,null,null,null,null,null,null,null,null,null,null,2]
[null,null,null,null,null,null,null,null,null,null,null,null,null,null,null,null,null,null,null,null,null,null,null,3]
[null,null,null,null,null,null,null,null,null,null,null,null,null,null,null,null,null,null,null,null,null,null,null,4]
[null,null,null,null,null,null,null,null,null,null,null,null,null,null,null,null,null,null,null,null,null,null,null,5]

{"sheet":"HD2.2a","index":18,"n_rows":15,"n_cols":16,"rows_kept":15,"cut":false,"hidden":false,"merged":[[9,1,9,3],[1,1,1,15],[2,1,2,7],[2,9,2,15],[3,1,4,1],[3,2,3,3],[3,4,3,5],[3,8,4,8],[3,9,4,9],[3,10,3,11],[3,12,3,13]]}
[]
[null,"Pertes définitives"]
[null,"Attaquant",null,null,null,null,null,null,null,"Défenseur"]
[null,"Unité","Effectif",null,"Puissance",null,"Cout en or","Cout en rares","Peloton","Unité","Effectif",null,"Puissance",null,"Cout en or","Cout en rares"]
[null,null,"Initial","Perdu","Initiale","Perdue","des pertes","des pertes",null,null,"Initial","Perdu","Initiale","Perdue","des pertes","des pertes"]
[null,"Succube",6,1,"5 508",918,"1 848","—",1,"Fantassin",34,34,"13 838","13 838","29 920","—"]
[null,"Maitresse succube",3,1,"3 303","1 101","2 217","—",2,"Conscrit",63,63,"8 064","8 064","17 451","—"]
[null,"Familier",80,12,"6 880","1 032","2 712","—",3,"Paysan",77,77,"7 469","7 469","16 940","—"]
[null,null,89,14,"15 691","3 051","6 777","—","Total",null,174,174,"29 371","29 371","64 311","—"]
[null,"Expérience"]
[null,"Attaquant",null,"Défenseur"]
[null,0.87180000000000002,"Honneur","/"]
[null,"1 958","Expérience de base","/",null,null,"Victoire écrasante"]
[null,0.87180000000000002,"Modificateur total","/",null,null,"Flèche des arcanes au tour 1"]
[null,"3 665","Expérience totale","/"]

{"sheet":"Feuil1","index":19,"n_rows":0,"n_cols":0,"rows_kept":0,"cut":false,"hidden":false,"merged":[]}

{"sheet":"Feuil2","index":20,"n_rows":0,"n_cols":0,"rows_kept":0,"cut":false,"hidden":false,"merged":[]}